only build symmetric dirichlet problem if adolc is available

6 jobs for symmetric_dirichlet_problem in 8 minutes and 39 seconds (queued for 1 second)
Status Name Job ID Coverage
  Test
passed clang-c++11 #81903
Linux

00:08:38

failed CoMISo-VS2013-Qt-5.5.1-x64 #81905
VS2013 Qt551

00:01:14

failed CoMISo-VS2017-Qt-5.10.1-x64 #81906
VS2017 IPOPT3129

00:01:36

passed gcc-c++11 #81902
Linux

00:06:28

failed macos-c++11 #81904
Apple

00:02:32

 
  Deploy
skipped trigger_build #81907
 
Name Stage Failure
failed
macos-c++11 Test
  ^
/Users/jenkins/builds/b72f60fc/0/CoMISo/CoMISo/Examples/small_symmetric_dirichlet/main.cc:83:106: error: use of undeclared identifier 'std'
std::cerr << "Warning: Example cannot be executed since either EIGEN3 or ADOLC is not available..." << std::endl;
^
2 errors generated.
make[2]: *** [Examples/small_symmetric_dirichlet/CMakeFiles/small_symmetric_dirichlet.dir/main.cc.o] Error 1
make[1]: *** [Examples/small_symmetric_dirichlet/CMakeFiles/small_symmetric_dirichlet.dir/all] Error 2
make: *** [all] Error 2
ERROR: Job failed: exit status 1
failed
CoMISo-VS2013-Qt-5.5.1-x64 Test
16>     Creating library E:/gitlab/builds/1900f1de/0/CoMISo/CoMISo/rel/Examples/small_quadratic_example/Release/small_quadratic_solver.lib and object E:/gitlab/builds/1900f1de/0/CoMISo/CoMISo/rel/Examples/small_quadratic_example/Release/small_quadratic_solver.exp
16> small_quadratic_solver.vcxproj -> E:\gitlab\builds\1900f1de\0\CoMISo\CoMISo\rel\Examples\small_quadratic_example\Release\small_quadratic_solver.exe
5> Creating library E:/gitlab/builds/1900f1de/0/CoMISo/CoMISo/rel/Examples/small_AQP/Release/small_AQP.lib and object E:/gitlab/builds/1900f1de/0/CoMISo/CoMISo/rel/Examples/small_AQP/Release/small_AQP.exp
5> small_AQP.vcxproj -> E:\gitlab\builds\1900f1de\0\CoMISo\CoMISo\rel\Examples\small_AQP\Release\small_AQP.exe
19>------ Build started: Project: ALL_BUILD, Configuration: Release x64 ------
19> Building Custom Rule E:/gitlab/builds/1900f1de/0/CoMISo/CoMISo/CMakeLists.txt
19> CMake does not need to re-run because E:/gitlab/builds/1900f1de/0/CoMISo/CoMISo/rel/CMakeFiles/generate.stamp is up-to-date.
========== Build: 18 succeeded, 1 failed, 0 up-to-date, 0 skipped ==========
ERROR: Job failed: exit status 1
failed
CoMISo-VS2017-Qt-5.10.1-x64 Test
16>Done building project "small_quadratic_solver.vcxproj".
5> Creating library E:/gitlab/builds/9d73ae51/0/CoMISo/CoMISo/rel/Examples/small_AQP/Release/small_AQP.lib and object E:/gitlab/builds/9d73ae51/0/CoMISo/CoMISo/rel/Examples/small_AQP/Release/small_AQP.exp
5>small_AQP.vcxproj -> E:\gitlab\builds\9d73ae51\0\CoMISo\CoMISo\rel\Examples\small_AQP\Release\small_AQP.exe
5>Done building project "small_AQP.vcxproj".
19>------ Build started: Project: ALL_BUILD, Configuration: Release x64 ------
19>Building Custom Rule E:/gitlab/builds/9d73ae51/0/CoMISo/CoMISo/CMakeLists.txt
19>CMake does not need to re-run because E:/gitlab/builds/9d73ae51/0/CoMISo/CoMISo/rel/CMakeFiles/generate.stamp is up-to-date.
========== Build: 18 succeeded, 1 failed, 0 up-to-date, 0 skipped ==========
ERROR: Job failed: exit status 1