Updated cmake-library ton head

5 jobs for Use_gurobi_finder_from_library in 5 minutes and 14 seconds (queued for 1 second)
Status Name Job ID Coverage
  Test
failed clang-c++11 #124525
Linux

00:03:40

passed CoMISo-VS2017-Qt-5.10.1-x64 #124527
VS2017 IPOPT3129

00:01:20

failed gcc-c++11 #124524
Linux

00:01:38

passed macos-c++11 #124526
Apple

00:05:14

 
  Deploy
skipped trigger_build #124528
 
Name Stage Failure
failed
gcc-c++11 Test
[ 43%] Building CXX object CMakeFiles/CoMISo.dir/EigenSolver/ArpackSolver.cc.o
[ 44%] Building CXX object CMakeFiles/CoMISo.dir/Utils/CoMISoError.cc.o
[ 45%] Building CXX object CMakeFiles/CoMISo.dir/Utils/ExactConstraintSatisfaction.cc.o
[ 45%] Building CXX object CMakeFiles/CoMISo.dir/QtWidgets/MISolverDialogUI.cc.o
make[2]: *** No rule to make target 'libGurobiCXX.a', needed by 'Build/lib/libCoMISo.so'. Stop.
make[1]: *** [CMakeFiles/Makefile2:479: CMakeFiles/CoMISo.dir/all] Error 2
make: *** [Makefile:130: all] Error 2
Cleaning up file based variables
ERROR: Job failed: exit status 1
failed
clang-c++11 Test
/local/gitlab-runner/builds/LXd-zr_A/0/CoMISo/CoMISo/Solver/GMM_ToolsT_impl.hh:175:43: warning: unused typedef 'MatrixT' [-Wunused-local-typedef]
typedef typename gmm::csc_matrix<RealT> MatrixT;
^
7 warnings generated.
make[2]: *** No rule to make target 'libGurobiCXX.a', needed by 'Build/lib/libCoMISo.so'. Stop.
make[1]: *** [CMakeFiles/Makefile2:479: CMakeFiles/CoMISo.dir/all] Error 2
make: *** [Makefile:130: all] Error 2
Cleaning up file based variables
ERROR: Job failed: exit status 1