improved infeasible start Newton

5 jobs for cgg2 in 11 minutes and 30 seconds (queued for 1 second)
Status Job ID Name Coverage
  Test
passed clang-c++11 #130293
Linux

00:11:30

failed CoMISo-VS2017-Qt-5.10.1-x64 #130295
VS2017 IPOPT3129

00:00:18

passed gcc-c++11 #130292
Linux

00:05:21

failed macos-c++11 #130294
Apple

00:00:20

 
  Deploy
skipped trigger_build #130296
 
Name Stage Failure
failed
macos-c++11 Test
/Users/jenkins/builds/b72f60fc/0/CoMISo/CoMISo/Solver/ConstrainedSolverT.cc:760:44: error: no member named 'swap' in 'gmm::simple_vector_ref<gmm::wsvector<double> *>'
gmm::mat_row(d_tmp, row_ordering[i]).swap(gmm::mat_row(rhs_update_table_.D_, i));
~~~~~~~~~~~~~~~~~~~~~~~~~~~~~~~~~~~~ ^
1 error generated.
make[2]: *** [CMakeFiles/CoMISo.dir/Solver/ConstrainedSolver.cc.o] Error 1
make[1]: *** [CMakeFiles/CoMISo.dir/all] Error 2
make: *** [all] Error 2
Cleaning up file based variables
ERROR: Job failed: exit status 1
failed
CoMISo-VS2017-Qt-5.10.1-x64 Test


-- Configuring incomplete, errors occurred!
See also "E:/gitlab/builds/jYir6YD5/0/CoMISo/CoMISo/rel/CMakeFiles/CMakeOutput.log".
See also "E:/gitlab/builds/jYir6YD5/0/CoMISo/CoMISo/rel/CMakeFiles/CMakeError.log".

E:\gitlab\builds\jYir6YD5\0\CoMISo\CoMISo\rel>IF 1 NEQ 0 exit /b 1
Cleaning up file based variables
ERROR: Job failed: exit status 1