Updated finders

6 jobs for master in 15 minutes and 12 seconds
Status Job ID Name Coverage
  Test
failed clang-c++11 #7565
Linux

00:00:00

passed clang-c++98 #7567
Linux

00:04:01

passed gcc-c++11 #7564
Linux

00:06:07

passed gcc-c++98 #7566
Linux

00:04:31

failed macos-c++11 #7568
Apple

00:00:15

failed macos-c++98 #7569
Apple

00:00:16

 
Name Stage Failure
failed
clang-c++11 Test There is an unknown failure, please try again
Running with gitlab-ci-multi-runner 1.4.1 (fae8f18)
Using Shell executor...
Running on beatrix...
error: could not lock config file /local/gitlab-runner/.gitconfig: File exists
ERROR: Build failed: exit status 1
failed
macos-c++11 Test There is an unknown failure, please try again
      msg << "Level " << level_ << " Warning in "__FILE__ << ", line " \
^
fatal error: too many errors emitted, stopping now [-ferror-limit=]
20 errors generated.
make[2]: *** [CMakeFiles/CoMISo.dir/Solver/CholmodSolver.cc.o] Error 1
make[1]: *** [CMakeFiles/CoMISo.dir/all] Error 2
make: *** [all] Error 2

ERROR: Build failed: exit status 1
failed
macos-c++98 Test There is an unknown failure, please try again
/Users/jenkins/sw/gmm-4.1/include/gmm/gmm_blas_interface.h:159:32: warning: 'zdotc_' has C-linkage specified, but returns user-defined type 'std::complex<double>' which is incompatible with C [-Wreturn-type-c-linkage]
BLAS_C cdotc_(...); BLAS_Z zdotc_(...);
^
4 warnings and 4 errors generated.
make[2]: *** [CMakeFiles/CoMISo.dir/Solver/CholmodSolver.cc.o] Error 1
make[1]: *** [CMakeFiles/CoMISo.dir/all] Error 2
make: *** [all] Error 2

ERROR: Build failed: exit status 1