Updated cgal finder

6 jobs for master in 19 minutes and 46 seconds
Status Name Job ID Coverage
  Test
passed clang-c++11 #7577
Linux

00:04:56

passed clang-c++98 #7579
Linux

00:03:51

passed gcc-c++11 #7576
Linux

00:05:55

passed gcc-c++98 #7578
Linux

00:04:40

failed macos-c++11 #7580
Apple

00:00:14

failed macos-c++98 #7581
Apple

00:00:08

 
Name Stage Failure
failed
macos-c++11 Test There is an unknown failure, please try again
      msg << "Level " << level_ << " Warning in "__FILE__ << ", line " \
^
fatal error: too many errors emitted, stopping now [-ferror-limit=]
20 errors generated.
make[2]: *** [CMakeFiles/CoMISo.dir/Solver/CholmodSolver.cc.o] Error 1
make[1]: *** [CMakeFiles/CoMISo.dir/all] Error 2
make: *** [all] Error 2

ERROR: Build failed: exit status 1
failed
macos-c++98 Test There is an unknown failure, please try again
/Users/jenkins/sw/gmm-4.1/include/gmm/gmm_blas_interface.h:159:32: warning: 'zdotc_' has C-linkage specified, but returns user-defined type 'std::complex<double>' which is incompatible with C [-Wreturn-type-c-linkage]
BLAS_C cdotc_(...); BLAS_Z zdotc_(...);
^
4 warnings and 4 errors generated.
make[2]: *** [CMakeFiles/CoMISo.dir/Solver/CholmodSolver.cc.o] Error 1
make[1]: *** [CMakeFiles/CoMISo.dir/all] Error 2
make: *** [all] Error 2

ERROR: Build failed: exit status 1