Added Base as sub-module...

Added Base as sub-module (https://www.graphics.rwth-aachen.de:9000/CoMISo/Base.git) mapped to the Base folder.
6 jobs for unify_with_ReForm
Status Job ID Name Coverage
  Test
failed clang-c++11 #1588
Linux

00:00:09

failed clang-c++98 #1590
Linux

00:00:08

failed gcc-c++11 #1587
Linux

00:00:04

failed gcc-c++98 #1589
Linux

00:00:03

failed macos-c++11 #1591
Apple

00:00:07

failed macos-c++98 #1592
Apple

00:00:04

 
Name Stage Failure
failed
gcc-c++11 Test There is an unknown failure, please try again
compilation terminated.
CMakeFiles/CoMISo.dir/build.make:64: recipe for target 'CMakeFiles/CoMISo.dir/Solver/SparseQRSolver.cc.o' failed
make[2]: *** [CMakeFiles/CoMISo.dir/Solver/SparseQRSolver.cc.o] Error 1
CMakeFiles/Makefile2:60: recipe for target 'CMakeFiles/CoMISo.dir/all' failed
make[1]: *** [CMakeFiles/CoMISo.dir/all] Error 2
Makefile:117: recipe for target 'all' failed
make: *** [all] Error 2

ERROR: Build failed with: exit status 1
failed
clang-c++11 Test There is an unknown failure, please try again
1 error generated.
CMakeFiles/CoMISo.dir/build.make:87: recipe for target 'CMakeFiles/CoMISo.dir/Solver/MISolver.cc.o' failed
make[2]: *** [CMakeFiles/CoMISo.dir/Solver/MISolver.cc.o] Error 1
CMakeFiles/Makefile2:60: recipe for target 'CMakeFiles/CoMISo.dir/all' failed
make[1]: *** [CMakeFiles/CoMISo.dir/all] Error 2
Makefile:117: recipe for target 'all' failed
make: *** [all] Error 2

ERROR: Build failed with: exit status 1
failed
gcc-c++98 Test There is an unknown failure, please try again
compilation terminated.
CMakeFiles/CoMISo.dir/build.make:64: recipe for target 'CMakeFiles/CoMISo.dir/Solver/SparseQRSolver.cc.o' failed
make[2]: *** [CMakeFiles/CoMISo.dir/Solver/SparseQRSolver.cc.o] Error 1
CMakeFiles/Makefile2:60: recipe for target 'CMakeFiles/CoMISo.dir/all' failed
make[1]: *** [CMakeFiles/CoMISo.dir/all] Error 2
Makefile:117: recipe for target 'all' failed
make: *** [all] Error 2

ERROR: Build failed with: exit status 1
failed
clang-c++98 Test There is an unknown failure, please try again
1 error generated.
CMakeFiles/CoMISo.dir/build.make:110: recipe for target 'CMakeFiles/CoMISo.dir/Solver/EigenLDLTSolver.cc.o' failed
make[2]: *** [CMakeFiles/CoMISo.dir/Solver/EigenLDLTSolver.cc.o] Error 1
CMakeFiles/Makefile2:60: recipe for target 'CMakeFiles/CoMISo.dir/all' failed
make[1]: *** [CMakeFiles/CoMISo.dir/all] Error 2
Makefile:117: recipe for target 'all' failed
make: *** [all] Error 2

ERROR: Build failed with: exit status 1
failed
macos-c++11 Test There is an unknown failure, please try again
/Users/jenkins/gitlab-runner/builds/8dfb9a4a/0/CoMISo/CoMISo/Solver/CholmodSolver.hh:43:10: fatal error: 'Base/Utils/StopWatch.hh' file not found
#include <Base/Utils/StopWatch.hh>
^
1 error generated.
make[2]: *** [CMakeFiles/CoMISo.dir/Solver/CholmodSolver.cc.o] Error 1
make[1]: *** [CMakeFiles/CoMISo.dir/all] Error 2
make: *** [all] Error 2

ERROR: Build failed with: exit status 1
failed
macos-c++98 Test There is an unknown failure, please try again
/Users/jenkins/gitlab-runner/builds/8dfb9a4a/0/CoMISo/CoMISo/Solver/CholmodSolver.hh:43:10: fatal error: 'Base/Utils/StopWatch.hh' file not found
#include <Base/Utils/StopWatch.hh>
^
1 error generated.
make[2]: *** [CMakeFiles/CoMISo.dir/Solver/CholmodSolver.cc.o] Error 1
make[1]: *** [CMakeFiles/CoMISo.dir/all] Error 2
make: *** [all] Error 2

ERROR: Build failed with: exit status 1