Install T.cc files as well

6 jobs for master
Status Name Job ID Coverage
  Test
passed clang-c++11 #1923
Linux

00:03:58

passed clang-c++98 #1925
Linux

00:03:08

passed gcc-c++11 #1922
Linux

00:04:17

passed gcc-c++98 #1924
Linux

00:03:09

failed macos-c++11 #1926
Apple

00:01:07

failed macos-c++98 #1927
Apple

00:00:53

 
Name Stage Failure
failed
macos-c++11 Test There is an unknown failure, please try again
  "_umfpack_di_symbolic", referenced from:
COMISO::UMFPACKSolver::calc_system(std::__1::vector<int, std::__1::allocator<int> > const&, std::__1::vector<int, std::__1::allocator<int> > const&, std::__1::vector<double, std::__1::allocator<double> > const&) in UMFPACKSolver.cc.o
ld: symbol(s) not found for architecture x86_64
clang: error: linker command failed with exit code 1 (use -v to see invocation)
make[2]: *** [libCoMISo.dylib] Error 1
make[1]: *** [CMakeFiles/CoMISo.dir/all] Error 2
make: *** [all] Error 2

ERROR: Build failed with: exit status 1
failed
macos-c++98 Test There is an unknown failure, please try again
  "_umfpack_di_symbolic", referenced from:
COMISO::UMFPACKSolver::calc_system(std::__1::vector<int, std::__1::allocator<int> > const&, std::__1::vector<int, std::__1::allocator<int> > const&, std::__1::vector<double, std::__1::allocator<double> > const&) in UMFPACKSolver.cc.o
ld: symbol(s) not found for architecture x86_64
clang: error: linker command failed with exit code 1 (use -v to see invocation)
make[2]: *** [libCoMISo.dylib] Error 1
make[1]: *** [CMakeFiles/CoMISo.dir/all] Error 2
make: *** [all] Error 2

ERROR: Build failed with: exit status 1