Added max_linesearch_iters option to NewtonSolver.

8 jobs for ps_old in 7 minutes and 3 seconds
latest
Status Job ID Name Coverage
  Test
passed clang-c++11 #51157
Linux

00:04:34

failed clang-c++98 #51159
Linux

00:00:19

failed CoMISo-VS2013-Qt-5.5.1-x64 #51162
VS2013 Qt551

00:00:05

passed gcc-c++11 #51156
Linux

00:06:58

passed gcc-c++98 #51158
Linux

00:07:02

passed macos-c++11 #51160
Apple

00:04:45

failed macos-c++98 #51161
Apple

00:00:42

 
  Deploy
skipped trigger_build #51163
 
Name Stage Failure
failed
clang-c++98 Test
fatal error: too many errors emitted, stopping now [-ferror-limit=]
20 errors generated.
CMakeFiles/CoMISo.dir/build.make:302: recipe for target 'CMakeFiles/CoMISo.dir/Solver/CholmodSolver.cc.o' failed
make[2]: *** [CMakeFiles/CoMISo.dir/Solver/CholmodSolver.cc.o] Error 1
CMakeFiles/Makefile2:99: recipe for target 'CMakeFiles/CoMISo.dir/all' failed
make[1]: *** [CMakeFiles/CoMISo.dir/all] Error 2
Makefile:127: recipe for target 'all' failed
make: *** [all] Error 2
ERROR: Job failed: exit status 1
failed
macos-c++98 Test
            ^
/Users/jenkins/builds/8dfb9a4a/0/CoMISo/CoMISo/NSolver/LBFGSSolver.cc:113:9: warning: 'auto' type specifier is a C++11 extension [-Wc++11-extensions]
auto delta_f = f - newf;
^
25 warnings and 2 errors generated.
make[2]: *** [CMakeFiles/CoMISo.dir/NSolver/LBFGSSolver.cc.o] Error 1
make[1]: *** [CMakeFiles/CoMISo.dir/all] Error 2
make: *** [all] Error 2
ERROR: Job failed: exit status 1
failed
CoMISo-VS2013-Qt-5.5.1-x64 Test
 - [deleted]         (none)     -> origin/ps
* [new branch] CMake_to_build_Debug-msvc -> origin/CMake_to_build_Debug-msvc
* [new branch] ps_old -> origin/ps_old
Checking out 519345c8 as ps_old...
Skipping Git submodules setup
$ CI\Windows.bat
'"C:\Program Files (x86)\CMake\bin\cmake.exe"' is not recognized as an internal or external command,
operable program or batch file.
ERROR: Job failed: exit status 9009