fix test for empty list

6 jobs for CMakeTargetDebugging in 6 minutes and 46 seconds (queued for 1 second)
Status Name Job ID Coverage
  Test
passed clang-c++11 #68319
Linux

00:05:17

failed CoMISo-VS2013-Qt-5.5.1-x64 #68321
VS2013 Qt551

00:01:04

failed CoMISo-VS2017-Qt-5.10.1-x64 #68322
VS2017 IPOPT3129

00:01:25

passed gcc-c++11 #68318
Linux

00:06:46

passed macos-c++11 #68320
Apple

00:02:56

 
  Deploy
skipped trigger_build #68323
 
Name Stage Failure
failed
CoMISo-VS2013-Qt-5.5.1-x64 Test
16>LINK : fatal error LNK1181: cannot open input file '..\..\Release\CoMISo.lib'
15>LINK : fatal error LNK1181: cannot open input file '..\..\Release\CoMISo.lib'
17>LINK : fatal error LNK1181: cannot open input file '..\..\Release\CoMISo.lib'
5>LINK : fatal error LNK1181: cannot open input file '..\..\Release\CoMISo.lib'
18>------ Build started: Project: ALL_BUILD, Configuration: Release x64 ------
18> Building Custom Rule E:/gitlab/builds/1900f1de/0/CoMISo/CoMISo/CMakeLists.txt
18> CMake does not need to re-run because E:/gitlab/builds/1900f1de/0/CoMISo/CoMISo/rel/CMakeFiles/generate.stamp is up-to-date.
========== Build: 2 succeeded, 16 failed, 0 up-to-date, 0 skipped ==========
ERROR: Job failed: exit status 1
failed
CoMISo-VS2017-Qt-5.10.1-x64 Test
16>Done building project "small_quadratic_solver.vcxproj".
5> Creating library E:/gitlab/builds/9d73ae51/0/CoMISo/CoMISo/rel/Examples/small_AQP/Release/small_AQP.lib and object E:/gitlab/builds/9d73ae51/0/CoMISo/CoMISo/rel/Examples/small_AQP/Release/small_AQP.exp
5>small_AQP.vcxproj -> E:\gitlab\builds\9d73ae51\0\CoMISo\CoMISo\rel\Examples\small_AQP\Release\small_AQP.exe
5>Done building project "small_AQP.vcxproj".
18>------ Build started: Project: ALL_BUILD, Configuration: Release x64 ------
18>Building Custom Rule E:/gitlab/builds/9d73ae51/0/CoMISo/CoMISo/CMakeLists.txt
18>CMake does not need to re-run because E:/gitlab/builds/9d73ae51/0/CoMISo/CoMISo/rel/CMakeFiles/generate.stamp is up-to-date.
========== Build: 17 succeeded, 1 failed, 0 up-to-date, 0 skipped ==========
ERROR: Job failed: exit status 1