Adjust samples to new renderscene

5 jobs for feature/adjust-samples in 17 minutes and 28 seconds
Status Name Job ID Coverage
  Build
failed clang-buster #74035
Linux buster

00:15:45

failed clang-stretch #74037
Linux stretch

00:13:01

failed gcc-buster #74034
Linux buster

00:01:41

failed gcc-stretch #74036
Linux stretch

00:01:21

failed VS2017-x64 #74033
VS2017

00:04:09

 
Name Stage Failure
failed
VS2017-x64 Build
46>FlowAnim.vcxproj -> E:\gitlab\builds\281b716d\0\Glow\glow-samples\bin\Release\FlowAnim.exe
46>Done building project "FlowAnim.vcxproj".
47>FractalPaint.vcxproj -> E:\gitlab\builds\281b716d\0\Glow\glow-samples\bin\Release\FractalPaint.exe
47>Done building project "FractalPaint.vcxproj".
48>------ Build started: Project: ALL_BUILD, Configuration: Release x64 ------
48>Building Custom Rule E:/gitlab/builds/281b716d/0/Glow/glow-samples/CMakeLists.txt
48>CMake does not need to re-run because E:/gitlab/builds/281b716d/0/Glow/glow-samples/build/CMakeFiles/generate.stamp is up-to-date.
========== Build: 46 succeeded, 2 failed, 0 up-to-date, 0 skipped ==========
ERROR: Job failed: exit status 1
failed
gcc-buster Build
                 from /data-hdd/gitlab-runner/builds/mhfSL8ex/0/Glow/glow-samples/extern/glm/glm/vec2.hpp:5,
from /data-hdd/gitlab-runner/builds/mhfSL8ex/0/Glow/glow-samples/extern/glm/glm/glm.hpp:116,
from /data-hdd/gitlab-runner/builds/mhfSL8ex/0/Glow/glow-samples/extern/glm/glm/ext.hpp:9,
from /data-hdd/gitlab-runner/builds/mhfSL8ex/0/Glow/glow-samples/samples/wip/main-loop/MainLoopSample.hh:3,
from /data-hdd/gitlab-runner/builds/mhfSL8ex/0/Glow/glow-samples/samples/wip/main-loop/MainLoopSample.cc:1:
/data-hdd/gitlab-runner/builds/mhfSL8ex/0/Glow/glow-samples/extern/glm/glm/./ext/../detail/type_vec2.hpp:17:9: note: ‘glm::i8vec2’ {aka ‘struct glm::vec<2, signed char, (glm::qualifier)0>’} declared here
struct vec<2, T, Q>
^~~~~~~~~~~~
In file inclu
Job's log exceeded limit of 4194304 bytes.
failed
clang-buster Build
[ 92%] Building CXX object samples/basic/weighted-OIT/CMakeFiles/WeightedOIT.dir/WeightedOITSample.cc.o
/data-hdd/gitlab-runner/builds/mhfSL8ex/0/Glow/glow-samples/samples/basic/weighted-OIT/WeightedOITSample.cc:29:25: error: no member named 'atmoScatter' in 'glow::pipeline::RenderScene'
getPipelineScene()->atmoScatter.intensity = 0.f;
~~~~~~~~~~~~~~~~~~ ^
1 error generated.
make[2]: *** [samples/basic/weighted-OIT/CMakeFiles/WeightedOIT.dir/build.make:63: samples/basic/weighted-OIT/CMakeFiles/WeightedOIT.dir/WeightedOITSample.cc.o] Error 1
make[1]: *** [CMakeFiles/Makefile2:2448: samples/basic/weighted-OIT/CMakeFiles/WeightedOIT.dir/all] Error 2
make: *** [Makefile:84: all] Error 2
ERROR: Job failed: exit status 1
failed
gcc-stretch Build
[ 98%] Linking CXX executable ../../../../bin/Release/MainLoop
[ 98%] Linking CXX executable ../../../../bin/Release/GeometryGrass
[ 98%] Built target MainLoop
[ 98%] Built target GeometryGrass
[ 98%] Linking CXX executable ../../../../bin/Release/MassivePoints
[ 98%] Built target MassivePoints
Makefile:83: recipe for target 'all' failed
make: *** [all] Error 2
ERROR: Job failed: exit status 1
failed
clang-stretch Build
    ~~~~~~~~~~~~~~~~~~  ^
1 error generated.
samples/basic/weighted-OIT/CMakeFiles/WeightedOIT.dir/build.make:62: recipe for target 'samples/basic/weighted-OIT/CMakeFiles/WeightedOIT.dir/WeightedOITSample.cc.o' failed
make[2]: *** [samples/basic/weighted-OIT/CMakeFiles/WeightedOIT.dir/WeightedOITSample.cc.o] Error 1
CMakeFiles/Makefile2:2447: recipe for target 'samples/basic/weighted-OIT/CMakeFiles/WeightedOIT.dir/all' failed
make[1]: *** [samples/basic/weighted-OIT/CMakeFiles/WeightedOIT.dir/all] Error 2
Makefile:83: recipe for target 'all' failed
make: *** [all] Error 2
ERROR: Job failed: exit status 1