started plotting

3 jobs for feature/plotting in 21 minutes and 10 seconds
latest
Status Name Job ID Coverage
  Build
failed clang-buster #80244
Linux buster

00:19:06

failed gcc-buster #80243
Linux buster

00:02:03

failed VS2017-x64 #80242
VS2017

00:03:59

 
Name Stage Failure
failed
gcc-buster Build
/data-hdd/gitlab-runner/builds/mhfSL8ex/0/Glow/glow-samples/extern/glm/glm/./ext/../detail/type_vec4.hpp:17:9: note: ‘glm::i16vec4’ {aka ‘struct glm::vec<4, short int, (glm::qualifier)0>’} declared here
struct vec<4, T, Q>
^~~~~~~~~~~~
In file included from /data-hdd/gitlab-runner/builds/mhfSL8ex/0/Glow/glow-samples/extern/glm/glm/./gtc/packing.hpp:728,
from /data-hdd/gitlab-runner/builds/mhfSL8ex/0/Glow/glow-samples/extern/glm/glm/ext.hpp:125,
from /data-hdd/gitlab-runner/builds/mhfSL8ex/0/Glow/glow-samples/samples/wip/main-loop/MainLoopSample.hh:3,
from /data-hdd/gitlab-runner/builds/mhfSL8ex/0/Glow/glow-samples/samples/wip/main-loop/MainLoopSample.cc:1:
/data-hdd/gitlab-runner/builds/mhfSL8ex/0/Glow/glow-samples/extern/glm/glm/./gtc/packing.inl: In function ‘glm::vec4 glm::unpackHalf4x16(glm::uint64)’:
/data-hdd/gitlab-runner/builds/mhfSL8ex/0/Glow/glow-samples/extern/glm/glm/./gtc/packing.inl:506:37: warning: ‘void* memcpy(void*, const void*, size_t)’
Job's log exceeded limit of 4194304 bytes.
failed
clang-buster Build
            glm::view
/data-hdd/gitlab-runner/builds/mhfSL8ex/0/Glow/glow-samples/extern/glow-extras/viewer/./glow-extras/viewer/view.hh:320:43: note: 'glm::view' declared here
GLOW_VIEWER_INJECT_FUNCTION(glow::viewer::view);
^
5 errors generated.
make[2]: *** [samples/wip/plotting/CMakeFiles/Plotting.dir/build.make:63: samples/wip/plotting/CMakeFiles/Plotting.dir/main.cc.o] Error 1
make[1]: *** [CMakeFiles/Makefile2:3105: samples/wip/plotting/CMakeFiles/Plotting.dir/all] Error 2
make: *** [Makefile:84: all] Error 2
ERROR: Job failed: exit status 1
failed
VS2017-x64 Build
47>CubeCursion.vcxproj -> E:\gitlab\builds\1900f1de\0\Glow\glow-samples\bin\Release\CubeCursion.exe
47>Done building project "CubeCursion.vcxproj".
48>DistanceField.vcxproj -> E:\gitlab\builds\1900f1de\0\Glow\glow-samples\bin\Release\DistanceField.exe
48>Done building project "DistanceField.vcxproj".
49>------ Build started: Project: ALL_BUILD, Configuration: Release x64 ------
49>Building Custom Rule E:/gitlab/builds/1900f1de/0/Glow/glow-samples/CMakeLists.txt
49>CMake does not need to re-run because E:/gitlab/builds/1900f1de/0/Glow/glow-samples/build/CMakeFiles/generate.stamp is up-to-date.
========== Build: 48 succeeded, 1 failed, 0 up-to-date, 0 skipped ==========
ERROR: Job failed: exit status 1