Update Viewer sample with new examples

3 jobs for feature/update-viewer-sample in 27 minutes and 5 seconds (queued for 1 second)
Status Name Job ID Coverage
  Build
failed clang-buster #83259
Linux buster

00:24:49

failed gcc-buster #83258
Linux buster

00:02:14

failed VS2017-x64 #83257
VS2017

00:03:48

 
Name Stage Failure
failed
VS2017-x64 Build
44>shadow.vcxproj -> E:\gitlab\builds\281b716d\0\Glow\glow-samples\bin\Release\shadow.exe
44>Done building project "shadow.vcxproj".
47>FlowAnim.vcxproj -> E:\gitlab\builds\281b716d\0\Glow\glow-samples\bin\Release\FlowAnim.exe
47>Done building project "FlowAnim.vcxproj".
48>------ Build started: Project: ALL_BUILD, Configuration: Release x64 ------
48>Building Custom Rule E:/gitlab/builds/281b716d/0/Glow/glow-samples/CMakeLists.txt
48>CMake does not need to re-run because E:/gitlab/builds/281b716d/0/Glow/glow-samples/build/CMakeFiles/generate.stamp is up-to-date.
========== Build: 47 succeeded, 1 failed, 0 up-to-date, 0 skipped ==========
ERROR: Job failed: exit status 1
failed
gcc-buster Build
                 from /data-hdd/gitlab-runner/builds/mhfSL8ex/0/Glow/glow-samples/extern/glm/glm/ext.hpp:9,
from /data-hdd/gitlab-runner/builds/mhfSL8ex/0/Glow/glow-samples/samples/wip/main-loop/MainLoopSample.hh:3,
from /data-hdd/gitlab-runner/builds/mhfSL8ex/0/Glow/glow-samples/samples/wip/main-loop/MainLoopSample.cc:1:
/data-hdd/gitlab-runner/builds/mhfSL8ex/0/Glow/glow-samples/extern/glm/glm/./ext/../detail/type_vec2.hpp:17:9: note: ‘glm::i32vec2’ {aka ‘struct glm::vec<2, int, (glm::qualifier)0>’} declared here
struct vec<2, T, Q>
^~~~~~~~~~~~
In file included from /data-hdd/gitlab-runner/builds/mhfSL8ex/0/Glow/glow-samples/extern/glm/glm/./gtc/packing.hpp:728,
from /data-hdd/gitlab-runner/builds/mhfSL8ex/0/Glow/glow-samples/extern/glm/glm/ext.hpp:125,
from /data-hdd/gitlab-runner/builds/mhfSL8ex/0/
Job's log exceeded limit of 4194304 bytes.
failed
clang-buster Build
                               ~~~~~~~~~~~~~~^
/data-hdd/gitlab-runner/builds/mhfSL8ex/0/Glow/glow-samples/extern/glow-extras/viewer/./glow-extras/viewer/view.hh:245:121: note: expanded from macro 'GLOW_VIEWER_CONFIG'
#define GLOW_VIEWER_CONFIG(...) auto GLOW_MACRO_JOIN(_glow_viewer_scoped_config_, __COUNTER__) = ::glow::viewer::config(__VA_ARGS__)
^~~~~~~~~~~
4 errors generated.
make[2]: *** [samples/wip/viewer/CMakeFiles/Viewer.dir/build.make:63: samples/wip/viewer/CMakeFiles/Viewer.dir/main.cc.o] Error 1
make[1]: *** [CMakeFiles/Makefile2:3209: samples/wip/viewer/CMakeFiles/Viewer.dir/all] Error 2
make: *** [Makefile:84: all] Error 2
ERROR: Job failed: exit status 1