CI: windows artifact path

6 jobs for feature_CI in 24 minutes and 23 seconds (queued for 1 second)
latest
Status Name Job ID Coverage
  Build
passed clang-buster #70452
Linux buster

00:22:52

passed clang-stretch #70450
Linux stretch

00:15:33

passed gcc-buster #70451
Linux buster

00:01:30

passed gcc-stretch #70449
Linux stretch

00:01:51

failed VS2015-x64 #70448
VS2015

00:04:07

passed VS2017-x64 #70447
VS2017

00:04:32

 
Name Stage Failure
failed
VS2015-x64 Build
44>e:\gitlab\builds\281b716d\0\glow\glow-samples\samples\demo\flowanim\flowanimsample.cc(50): warning C4146: unary minus operator applied to unsigned type, result still unsigned
34>LINK : fatal error LNK1181: cannot open input file '..\..\..\extern\glow-extras\Release\glow-extras.lib'
43>LINK : fatal error LNK1181: cannot open input file '..\..\..\extern\glow-extras\Release\glow-extras.lib'
44>LINK : fatal error LNK1181: cannot open input file '..\..\..\extern\glow-extras\Release\glow-extras.lib'
45>------ Build started: Project: ALL_BUILD, Configuration: Release x64 ------
45> Building Custom Rule E:/gitlab/builds/281b716d/0/Glow/glow-samples/CMakeLists.txt
45> CMake does not need to re-run because E:/gitlab/builds/281b716d/0/Glow/glow-samples/build/CMakeFiles/generate.stamp is up-to-date.
========== Build: 15 succeeded, 30 failed, 0 up-to-date, 0 skipped ==========
ERROR: Job failed: exit status 1