fix reading attribute information from opengl driver

8 jobs for acg_attribute_query
latest
Status Job ID Name Coverage
  Test
failed clang-c++11-Qt4 #4135
Linux MultiThreads

00:05:46

passed clang-c++11-Qt5 #4139
Linux MultiThreads

00:10:03

failed clang-c++98-Qt4 #4137
Linux MultiThreads

00:03:58

passed clang-c++98-Qt5 #4141
Linux MultiThreads

00:06:53

failed gcc-c++11-Qt4 #4134
Linux

00:05:17

passed gcc-c++11-Qt5 #4138
Linux

00:06:33

failed gcc-c++98-Qt4 #4136
Linux

00:04:41

passed gcc-c++98-Qt5 #4140
Linux

00:04:13

 
Name Stage Failure
failed
gcc-c++11-Qt4 Test There is an unknown failure, please try again
[ 72%] Built target Plugin-MeshCompare
[ 73%] Linking CXX executable ../../../../Unittests/unittests
[ 73%] Built target unittests
[ 73%] Linking CXX shared module ../../Build/lib/plugins/libPlugin-PhilipsStereo.so
[ 73%] Built target Plugin-PhilipsStereo
Makefile:149: recipe for target 'all' failed
make: *** [all] Error 2

ERROR: Build failed: exit status 1
failed
clang-c++11-Qt4 Test There is an unknown failure, please try again
[ 72%] Built target openmesh
[ 72%] Building CXX object libs_required/OpenMesh/src/Unittests/CMakeFiles/unittests.dir/unittests_trimesh_circulator_vertex_face.cc.o
4 warnings generated.
[ 73%] Linking CXX executable ../../../../Unittests/unittests
[ 73%] Built target unittests
Makefile:149: recipe for target 'all' failed
make: *** [all] Error 2

ERROR: Build failed: exit status 1
failed
gcc-c++98-Qt4 Test There is an unknown failure, please try again
[ 73%] Built target unittests
[ 73%] Linking CXX shared module ../../Build/lib/plugins/libPlugin-SelectionBSplineCurve.so
[ 73%] Built target Plugin-SelectionBSplineCurve
[ 73%] Linking CXX shared module ../../Build/lib/plugins/libPlugin-SelectionBSplineSurface.so
[ 73%] Built target Plugin-SelectionBSplineSurface
Makefile:149: recipe for target 'all' failed
make: *** [all] Error 2

ERROR: Build failed: exit status 1
failed
clang-c++98-Qt4 Test There is an unknown failure, please try again
1 warning generated.
[ 72%] Linking CXX shared library ../../../../Build/python/openmesh.so
[ 73%] Linking CXX executable ../../../../Unittests/unittests
[ 73%] Built target openmesh
[ 73%] Built target unittests
Makefile:149: recipe for target 'all' failed
make: *** [all] Error 2

ERROR: Build failed: exit status 1