Switched to google test 1.10.0

38 jobs for master in 25 minutes and 55 seconds (queued for 5 seconds)
Status Name Job ID Coverage
  Build
failed build-debug-clang-cpp11-qt5.15.1 #128088
Linux stretch

00:06:14

failed build-debug-clang-cpp11-qt5.15.1-nopython #128089
Linux stretch

00:06:44

failed build-debug-gcc-cpp11-qt5.15.1 #128084
Linux stretch

00:03:05

failed build-debug-gcc-cpp11-qt5.15.1-nopython #128085
Linux stretch

00:02:37

canceled build-release-clang-cpp11-qt5.15.1 #128090
Linux stretch

00:06:31

canceled build-release-clang-cpp11-qt5.15.1-nopython #128091
Linux stretch

00:03:14

failed build-release-gcc-cpp11-qt5.11.2 #128078
Linux stretch

00:05:23

failed build-release-gcc-cpp11-qt5.11.2-nopython #128079
Linux stretch

00:05:01

failed build-release-gcc-cpp11-qt5.12.2 #128080
Linux stretch

00:05:17

failed build-release-gcc-cpp11-qt5.12.2-nopython #128081
Linux stretch

00:05:25

failed build-release-gcc-cpp11-qt5.13.0 #128082
Linux stretch

00:05:25

failed build-release-gcc-cpp11-qt5.13.0-nopython #128083
Linux stretch

00:04:57

failed build-release-gcc-cpp11-qt5.15.1 #128086
Linux stretch

00:05:56

failed build-release-gcc-cpp11-qt5.15.1-nopython #128087
Linux stretch

00:05:17

canceled cppcheck #128093
Linux stretch MultiThreads

00:01:21

canceled iwyu-release-clang-cpp11-qt5.13.0 #128092
Linux stretch

00:02:53

failed Mac-Cpp11 #128098
Apple qt5113

00:16:28

failed VS2017-Qt5.14.2-x64 #128096
VS2017 Qt5141 Python39

00:16:21

failed VS2017-Qt5.14.2-x64-NOPYTHON #128097
VS2017 Qt5141

00:14:36

failed VS2019-Qt5.15.0-x64 #128094
VS2019 Qt5150 Python39

00:10:35

canceled VS2019-Qt5.15.0-x64-NOPYTHON #128095
VS2019 Qt5150

00:06:19

 
  Test
skipped test-debug-clang-cpp11-qt5.15.1 #128104
Linux stretch MultiThreads
skipped test-debug-gcc-cpp11-qt5.15.1 #128102
Linux stretch MultiThreads
skipped Test:Mac-Cpp11 #128108
Apple qt5113
canceled test-release-clang-cpp11-qt5.15.1 #128105
Linux stretch MultiThreads

skipped test-release-gcc-cpp11-qt5.11.2 #128099
Linux stretch MultiThreads
skipped test-release-gcc-cpp11-qt5.12.2 #128100
Linux stretch MultiThreads
skipped test-release-gcc-cpp11-qt5.13.0 #128101
Linux stretch MultiThreads
skipped test-release-gcc-cpp11-qt5.15.1 #128103
Linux stretch MultiThreads
skipped Test:VS2017-Qt5.14.2-x64 #128107
VS2017 Qt5141 Python39
skipped Test:VS2019-Qt5.15.0-x64 #128106
VS2019 Qt5150 Python39
 
  Deploy
skipped Deploy:Mac-Cpp11 #128113
Apple qt5113
skipped Deploy:VS2017-Qt5.14.2-x64 #128111
VS2017 Qt5141 Python39
skipped Deploy:VS2017-Qt5.14.2-x64-NOPYTHON #128112
VS2017 Qt5141
skipped Deploy:VS2019-Qt5.15.0-x64 #128109
VS2019 Qt5150 Python39
canceled Deploy:VS2019-Qt5.15.0-x64-NOPYTHON #128110
VS2019 Qt5150

canceled Doc-publish #128114
stretch Linux

canceled Sources #128115
Linux stretch

 
Name Stage Failure
failed
build-release-gcc-cpp11-qt5.15.1-nopython Build
[ 60%] Linking CXX executable ../../../../../Unittests/unittests_doublevec
g++: error: /local-hdd/gitlab-runner/sw/gtest-1.10.0/lib/libgtest.a: No such file or directory
g++: error: /local-hdd/gitlab-runner/sw/gtest-1.10.0/lib/libgtest_main.a: No such file or directory
make[2]: *** [OpenFlipper/libs_required/OpenMesh/src/Unittests/CMakeFiles/unittests_doublevec.dir/build.make:977: Unittests/unittests_doublevec] Error 1
make[1]: *** [CMakeFiles/Makefile2:7729: OpenFlipper/libs_required/OpenMesh/src/Unittests/CMakeFiles/unittests_doublevec.dir/all] Error 2
make[1]: *** [CMakeFiles/Makefile2:7758: OpenFlipper/libs_required/OpenMesh/src/Unittests/CMakeFiles/unittests_customvec.dir/all] Error 2
make: *** [Makefile:171: all] Error 2
Cleaning up file based variables
ERROR: Job failed: exit status 1
failed
build-release-gcc-cpp11-qt5.11.2-nopython Build
/usr/bin/ld: CMakeFiles/unittests_customvec.dir/unittests_propertymanager.cc.o: in function `void testing::internal::FallbackPrinter::PrintValue<Custom::Vec<3> >(Custom::Vec<3> const&, std::ostream*)':
/usr/include/gtest/gtest-printers.h:271: undefined reference to `testing::internal::PrintBytesInObjectTo(unsigned char const*, unsigned long, std::ostream*)'
/usr/bin/ld: CMakeFiles/unittests_customvec.dir/unittests_propertymanager.cc.o:/usr/include/gtest/gtest-printers.h:271: more undefined references to `testing::internal::PrintBytesInObjectTo(unsigned char const*, unsigned long, std::ostream*)' follow
collect2: error: ld returned 1 exit status
make[2]: *** [OpenFlipper/libs_required/OpenMesh/src/Unittests/CMakeFiles/unittests_customvec.dir/build.make:977: Unittests/unittests_customvec] Error 1
make[1]: *** [CMakeFiles/Makefile2:7758: OpenFlipper/libs_required/OpenMesh/src/Unittests/CMakeFiles/unittests_customvec.dir/all] Error 2
make: *** [Makefile:171: all] Error 2
Cleaning up file based variables
ERROR: Job failed: exit status 1
failed
build-release-gcc-cpp11-qt5.13.0 Build
                 from /local-hdd/gitlab-runner/builds/9582e0e8/0/OpenFlipper-Free/OpenFlipper-Free/OpenFlipper/PythonInterpreter/PythonInterpreter.cc:44:
/usr/include/python3.9/ceval.h:130:37: note: declared here
130 | Py_DEPRECATED(3.9) PyAPI_FUNC(void) PyEval_InitThreads(void);
| ^~~~~~~~~~~~~~~~~~
[ 76%] Linking CXX executable ../../Build/bin/OpenFlipper
[ 76%] Built target OpenFlipper
make: *** [Makefile:171: all] Error 2
Cleaning up file based variables
ERROR: Job failed: exit status 1
failed
VS2017-Qt5.14.2-x64-NOPYTHON Build
205>--
205>-- fixup_bundle: done
205>Building Custom Rule E:/gitlab/builds/anDiytNs/0/OpenFlipper-Free/OpenFlipper-Free/CMakeLists.txt
205>Done building project "fixbundle.vcxproj".
206>------ Build started: Project: ALL_BUILD, Configuration: Release x64 ------
206>Building Custom Rule E:/gitlab/builds/anDiytNs/0/OpenFlipper-Free/OpenFlipper-Free/CMakeLists.txt
========== Build: 204 succeeded, 2 failed, 0 up-to-date, 0 skipped ==========
Cleaning up file based variables
ERROR: Job failed: exit status 1
failed
build-release-gcc-cpp11-qt5.11.2 Build
make[1]: *** [CMakeFiles/Makefile2:7750: OpenFlipper/libs_required/OpenMesh/src/Unittests/CMakeFiles/unittests_doublevec.dir/all] Error 2
collect2: error: ld returned 1 exit status
make[2]: *** [OpenFlipper/libs_required/OpenMesh/src/Unittests/CMakeFiles/unittests.dir/build.make:977: Unittests/unittests] Error 1
make[1]: *** [CMakeFiles/Makefile2:7808: OpenFlipper/libs_required/OpenMesh/src/Unittests/CMakeFiles/unittests.dir/all] Error 2
[ 81%] Linking CXX executable ../../Build/bin/OpenFlipper
[ 81%] Built target OpenFlipper
make: *** [Makefile:171: all] Error 2
Cleaning up file based variables
ERROR: Job failed: exit status 1
failed
build-release-gcc-cpp11-qt5.12.2 Build
                 from /local/gitlab-runner/builds/Xqxo6jru/0/OpenFlipper-Free/OpenFlipper-Free/OpenFlipper/PythonInterpreter/PythonInterpreter.cc:44:
/usr/include/python3.9/ceval.h:130:37: note: declared here
130 | Py_DEPRECATED(3.9) PyAPI_FUNC(void) PyEval_InitThreads(void);
| ^~~~~~~~~~~~~~~~~~
[ 78%] Linking CXX executable ../../Build/bin/OpenFlipper
[ 78%] Built target OpenFlipper
make: *** [Makefile:171: all] Error 2
Cleaning up file based variables
ERROR: Job failed: exit status 1
failed
build-release-gcc-cpp11-qt5.12.2-nopython Build
/usr/bin/ld: CMakeFiles/unittests_doublevec.dir/unittests_read_write_OM.cc.o: in function `void testing::internal::FallbackPrinter::PrintValue<RegisteredDataType>(RegisteredDataType const&, std::ostream*)':
/usr/include/gtest/gtest-printers.h:271: undefined reference to `testing::internal::PrintBytesInObjectTo(unsigned char const*, unsigned long, std::ostream*)'
/usr/bin/ld: CMakeFiles/unittests_doublevec.dir/unittests_read_write_OM.cc.o:/usr/include/gtest/gtest-printers.h:271: more undefined references to `testing::internal::PrintBytesInObjectTo(unsigned char const*, unsigned long, std::ostream*)' follow
collect2: error: ld returned 1 exit status
make[2]: *** [OpenFlipper/libs_required/OpenMesh/src/Unittests/CMakeFiles/unittests_doublevec.dir/build.make:977: Unittests/unittests_doublevec] Error 1
make[1]: *** [CMakeFiles/Makefile2:7729: OpenFlipper/libs_required/OpenMesh/src/Unittests/CMakeFiles/unittests_doublevec.dir/all] Error 2
make: *** [Makefile:171: all] Error 2
Cleaning up file based variables
ERROR: Job failed: exit status 1
failed
build-release-gcc-cpp11-qt5.13.0-nopython Build
[ 82%] Linking CXX executable ../../Build/bin/OpenFlipper
/usr/bin/ld: CMakeFiles/OpenFlipper.dir/OpenFlipper_autogen/mocs_compilation.cpp.o:(.data.rel.ro._ZTV17PythonInterpreter[_ZTV17PythonInterpreter]+0x28): undefined reference to `PythonInterpreter::~PythonInterpreter()'
/usr/bin/ld: CMakeFiles/OpenFlipper.dir/OpenFlipper_autogen/mocs_compilation.cpp.o:(.data.rel.ro._ZTV17PythonInterpreter[_ZTV17PythonInterpreter]+0x30): undefined reference to `PythonInterpreter::~PythonInterpreter()'
collect2: error: ld returned 1 exit status
make[2]: *** [OpenFlipper/CoreApp/CMakeFiles/OpenFlipper.dir/build.make:1356: Build/bin/OpenFlipper] Error 1
make[1]: *** [CMakeFiles/Makefile2:14875: OpenFlipper/CoreApp/CMakeFiles/OpenFlipper.dir/all] Error 2
make: *** [Makefile:171: all] Error 2
Cleaning up file based variables
ERROR: Job failed: exit status 1
failed
build-debug-gcc-cpp11-qt5.15.1 Build
make[1]: *** [CMakeFiles/Makefile2:7750: OpenFlipper/libs_required/OpenMesh/src/Unittests/CMakeFiles/unittests_doublevec.dir/all] Error 2
CMakeFiles/unittests.dir/unittests_read_write_OM.cc.o: in function `void testing::internal::FallbackPrinter::PrintValue<RegisteredDataType>(RegisteredDataType const&, std::ostream*)':
/usr/include/gtest/gtest-printers.h:271: undefined reference to `testing::internal::PrintBytesInObjectTo(unsigned char const*, unsigned long, std::ostream*)'
collect2: error: ld returned 1 exit status
make[2]: *** [OpenFlipper/libs_required/OpenMesh/src/Unittests/CMakeFiles/unittests.dir/build.make:977: Unittests/unittests] Error 1
make[1]: *** [CMakeFiles/Makefile2:7808: OpenFlipper/libs_required/OpenMesh/src/Unittests/CMakeFiles/unittests.dir/all] Error 2
make: *** [Makefile:171: all] Error 2
Cleaning up file based variables
ERROR: Job failed: exit status 1
failed
build-debug-gcc-cpp11-qt5.15.1-nopython Build
CMakeFiles/unittests_doublevec.dir/unittests_read_write_OM.cc.o: in function `void testing::internal::FallbackPrinter::PrintValue<RegisteredDataType>(RegisteredDataType const&, std::ostream*)':
/usr/include/gtest/gtest-printers.h:271: undefined reference to `testing::internal::PrintBytesInObjectTo(unsigned char const*, unsigned long, std::ostream*)'
[ 60%] Built target OpenFlipperPluginLib
collect2: error: ld returned 1 exit status
make[2]: *** [OpenFlipper/libs_required/OpenMesh/src/Unittests/CMakeFiles/unittests_doublevec.dir/build.make:977: Unittests/unittests_doublevec] Error 1
make[1]: *** [CMakeFiles/Makefile2:7729: OpenFlipper/libs_required/OpenMesh/src/Unittests/CMakeFiles/unittests_doublevec.dir/all] Error 2
make: *** [Makefile:171: all] Error 2
Cleaning up file based variables
ERROR: Job failed: exit status 1
failed
build-release-gcc-cpp11-qt5.15.1 Build
                 from /local/gitlab-runner/builds/LXd-zr_A/0/OpenFlipper-Free/OpenFlipper-Free/OpenFlipper/PythonInterpreter/PythonInterpreter.cc:44:
/usr/include/python3.9/ceval.h:130:37: note: declared here
130 | Py_DEPRECATED(3.9) PyAPI_FUNC(void) PyEval_InitThreads(void);
| ^~~~~~~~~~~~~~~~~~
[ 78%] Linking CXX executable ../../Build/bin/OpenFlipper
[ 78%] Built target OpenFlipper
make: *** [Makefile:171: all] Error 2
Cleaning up file based variables
ERROR: Job failed: exit status 1
failed
build-debug-clang-cpp11-qt5.15.1 Build
/usr/bin/ld: DWARF error: could not find variable specification at offset 283c6
CMakeFiles/unittests.dir/unittests_read_write_OM.cc.o: in function `void testing::internal::FallbackPrinter::PrintValue<RegisteredDataType>(RegisteredDataType const&, std::ostream*)':
/usr/include/gtest/gtest-printers.h:271: undefined reference to `testing::internal::PrintBytesInObjectTo(unsigned char const*, unsigned long, std::ostream*)'
clang: error: linker command failed with exit code 1 (use -v to see invocation)
make[2]: *** [OpenFlipper/libs_required/OpenMesh/src/Unittests/CMakeFiles/unittests.dir/build.make:977: Unittests/unittests] Error 1
make[1]: *** [CMakeFiles/Makefile2:7808: OpenFlipper/libs_required/OpenMesh/src/Unittests/CMakeFiles/unittests.dir/all] Error 2
make: *** [Makefile:171: all] Error 2
Cleaning up file based variables
ERROR: Job failed: exit status 1
failed
build-debug-clang-cpp11-qt5.15.1-nopython Build
/usr/bin/ld: DWARF error: could not find variable specification at offset 283c6
CMakeFiles/unittests.dir/unittests_read_write_OM.cc.o: in function `void testing::internal::FallbackPrinter::PrintValue<RegisteredDataType>(RegisteredDataType const&, std::ostream*)':
/usr/include/gtest/gtest-printers.h:271: undefined reference to `testing::internal::PrintBytesInObjectTo(unsigned char const*, unsigned long, std::ostream*)'
clang: error: linker command failed with exit code 1 (use -v to see invocation)
make[2]: *** [OpenFlipper/libs_required/OpenMesh/src/Unittests/CMakeFiles/unittests.dir/build.make:977: Unittests/unittests] Error 1
make[1]: *** [CMakeFiles/Makefile2:7787: OpenFlipper/libs_required/OpenMesh/src/Unittests/CMakeFiles/unittests.dir/all] Error 2
make: *** [Makefile:171: all] Error 2
Cleaning up file based variables
ERROR: Job failed: exit status 1
failed
VS2019-Qt5.15.0-x64 Build
205>--
205>-- fixup_bundle: done
205>Building Custom Rule E:/gitlab/builds/cu6mRa6g/0/OpenFlipper-Free/OpenFlipper-Free/CMakeLists.txt
205>Done building project "fixbundle.vcxproj".
206>------ Build started: Project: ALL_BUILD, Configuration: Release x64 ------
206>Building Custom Rule E:/gitlab/builds/cu6mRa6g/0/OpenFlipper-Free/OpenFlipper-Free/CMakeLists.txt
========== Build: 204 succeeded, 2 failed, 0 up-to-date, 0 skipped ==========
Cleaning up file based variables
ERROR: Job failed: exit status 1
failed
VS2017-Qt5.14.2-x64 Build
205>--
205>-- fixup_bundle: done
205>Building Custom Rule E:/gitlab/builds/jYir6YD5/0/OpenFlipper-Free/OpenFlipper-Free/CMakeLists.txt
205>Done building project "fixbundle.vcxproj".
206>------ Build started: Project: ALL_BUILD, Configuration: Release x64 ------
206>Building Custom Rule E:/gitlab/builds/jYir6YD5/0/OpenFlipper-Free/OpenFlipper-Free/CMakeLists.txt
========== Build: 204 succeeded, 2 failed, 0 up-to-date, 0 skipped ==========
Cleaning up file based variables
ERROR: Job failed: exit status 1
failed
Mac-Cpp11 Build
/Users/jenkins/builds/8dfb9a4a/0/OpenFlipper-Free/OpenFlipper-Free/Plugin-PropertyVis/Nodes/BoxesNode.cc:79:31: warning: suggest braces around initialization of subobject [-Wmissing-braces]
triangles_.push_back({vertices[v0], vertices[v1], vertices[v2]});
^~~~~~~~~~~~~~~~~~~~~~~~~~~~~~~~~~~~~~~~
{ }
4 warnings generated.
make[1]: *** [Plugin-PropertyVis/CMakeFiles/Plugin-PropertyVis.dir/all] Error 2
make: *** [all] Error 2
Cleaning up file based variables
ERROR: Job failed: exit status 1