fixed unknown return type error

46 jobs for qt_6 in 53 minutes and 35 seconds (queued for 12 seconds)
Status Job ID Name Coverage
  Build
passed build-debug-clang-cpp17-qt5.15.1 #133037
Linux stretch

00:18:41

passed build-debug-clang-cpp17-qt5.15.1-nopython #133038
Linux stretch

00:12:02

failed build-debug-clang-cpp17-qt6.1.2 #133047
Linux stretch

00:01:15

failed build-debug-clang-cpp17-qt6.1.2 -nopython #133048
Linux stretch

00:01:17

passed build-debug-gcc-cpp17-qt5.15.1 #133033
Linux stretch

00:14:29

passed build-debug-gcc-cpp17-qt5.15.1-nopython #133034
Linux stretch

00:11:25

failed build-debug-gcc-cpp17-qt6.1.2 #133043
Linux stretch

00:01:35

failed build-debug-gcc-cpp17-qt6.1.2 -nopython #133044
Linux stretch

00:01:46

passed build-release-clang-cpp17-qt5.15.1 #133039
Linux stretch

00:14:38

passed build-release-clang-cpp17-qt5.15.1-nopython #133040
Linux stretch

00:11:39

failed build-release-clang-cpp17-qt6.1.2 #133049
Linux stretch

00:01:29

failed build-release-clang-cpp17-qt6.1.2 -nopython #133050
Linux stretch

00:01:17

failed build-release-gcc-cpp17-qt5.11.2 #133027
Linux stretch

00:10:44

failed build-release-gcc-cpp17-qt5.11.2-nopython #133028
Linux stretch

00:11:03

failed build-release-gcc-cpp17-qt5.12.2 #133029
Linux stretch

00:10:29

failed build-release-gcc-cpp17-qt5.12.2-nopython #133030
Linux stretch

00:11:23

failed build-release-gcc-cpp17-qt5.13.0 #133031
Linux stretch

00:07:48

failed build-release-gcc-cpp17-qt5.13.0-nopython #133032
Linux stretch

00:10:32

passed build-release-gcc-cpp17-qt5.15.1 #133035
Linux stretch

00:13:25

passed build-release-gcc-cpp17-qt5.15.1-nopython #133036
Linux stretch

00:14:53

failed build-release-gcc-cpp17-qt6.0.4 #133041
Linux stretch

00:01:23

failed build-release-gcc-cpp17-qt6.0.4 -nopython #133042
Linux stretch

00:01:26

failed build-release-gcc-cpp17-qt6.1.2 #133045
Linux stretch

00:01:39

failed build-release-gcc-cpp17-qt6.1.2 -nopython #133046
Linux stretch

00:01:10

passed cppcheck #133052
Linux stretch MultiThreads

00:02:24

passed iwyu-release-clang-cpp17-qt5.13.0 #133051
Linux stretch

00:16:51

failed Mac-Cpp11 #133057
Apple qt5113

00:13:56

failed VS2019-Qt5.15.0-x64 #133053
VS2019 Qt5150 Python39

00:12:00

failed VS2019-Qt5.15.0-x64-NOPYTHON #133054
VS2019 Qt5150

00:15:53

failed VS2019-Qt6.1.2-x64 #133055
VS2019 Qt612 Python39

00:05:31

failed VS2019-Qt6.1.2-x64-NOPYTHON #133056
VS2019 Qt612

00:06:05

 
  Test
failed test-debug-clang-cpp17-qt5.15.1 #133063
Linux stretch MultiThreads

00:02:57

skipped test-debug-clang-cpp17-qt6.1.2 #133068
Linux stretch MultiThreads
failed test-debug-gcc-cpp17-qt5.15.1 #133061
Linux stretch MultiThreads

00:02:58

skipped test-debug-gcc-cpp17-qt6.1.2 #133066
Linux stretch MultiThreads
skipped Test:Mac-Cpp11 #133072
Apple qt5113
failed test-release-clang-cpp17-qt5.15.1 #133064
Linux stretch MultiThreads

00:01:35

skipped test-release-clang-cpp17-qt6.1.2 #133069
Linux stretch MultiThreads
skipped test-release-gcc-cpp17-qt5.11.2 #133058
Linux stretch MultiThreads
skipped test-release-gcc-cpp17-qt5.12.2 #133059
Linux stretch MultiThreads
skipped test-release-gcc-cpp17-qt5.13.0 #133060
Linux stretch MultiThreads
failed test-release-gcc-cpp17-qt5.15.1 #133062
Linux stretch MultiThreads

00:03:47

skipped test-release-gcc-cpp17-qt6.0.4 #133065
Linux stretch MultiThreads
skipped test-release-gcc-cpp17-qt6.1.2 #133067
Linux stretch MultiThreads
skipped Test:VS2019-Qt5.15.0-x64 #133070
VS2019 Qt5150 Python39
skipped Test:VS2019-Qt6.1.2-x64 #133071
VS2019 Qt612 Python39
 
Name Stage Failure
failed
VS2019-Qt6.1.2-x64 Build
  and include dir) to build with QT.  Note that this error is also shown if
not all required qt modules were found, e.g. Qt5Script.


-- Configuring incomplete, errors occurred!
See also "E:/gitlab/builds/cu6mRa6g/0/OpenFlipper-Free/OpenFlipper-Free/rel/CMakeFiles/CMakeOutput.log".
See also "E:/gitlab/builds/cu6mRa6g/0/OpenFlipper-Free/OpenFlipper-Free/rel/CMakeFiles/CMakeError.log".
Cleaning up file based variables
ERROR: Job failed: exit status 1
failed
test-release-gcc-cpp17-qt5.15.1 Test

The following tests FAILED:
10 - PLUGIN-SMOOTHER-smoother_c0_normal_10.ofs-cube_sharp.off (Failed)
11 - PLUGIN-SMOOTHER-smoother_c0_normal_10.ofp-cube_sharp.off (Failed)
Errors while running CTest
Return Code: 8
-----------------------
Cleaning up file based variables
ERROR: Job failed: exit status 1
failed
build-release-gcc-cpp17-qt6.0.4 -nopython Build
  and include dir) to build with QT.  Note that this error is also shown if
not all required qt modules were found, e.g. Qt5Script.


-- Configuring incomplete, errors occurred!
See also "/local-hdd/gitlab-runner/builds/9582e0e8/1/OpenFlipper-Free/OpenFlipper-Free/build-release-gcc-cpp17-nopython/CMakeFiles/CMakeOutput.log".
See also "/local-hdd/gitlab-runner/builds/9582e0e8/1/OpenFlipper-Free/OpenFlipper-Free/build-release-gcc-cpp17-nopython/CMakeFiles/CMakeError.log".
Cleaning up file based variables
ERROR: Job failed: exit status 1
failed
build-release-gcc-cpp17-qt5.11.2-nopython Build
      |                             ^
[ 76%] Linking CXX shared module ../../Build/lib/plugins/libPlugin-TypePolyMesh.so
[ 76%] Built target Plugin-TypePolyMesh
[ 76%] Built target unittests_doublevec
[ 76%] Linking CXX executable ../../../../../Unittests/unittests_customvec
[ 76%] Built target unittests_customvec
make: *** [Makefile:171: all] Error 2
Cleaning up file based variables
ERROR: Job failed: exit status 1
failed
build-release-gcc-cpp17-qt5.13.0 Build
[ 76%] Built target Plugin-Decimater
[ 76%] Built target unittests_customvec
[ 76%] Linking CXX executable ../../../../../Unittests/unittests
[ 76%] Linking CXX executable ../../../../../Unittests/unittests_doublevec
[ 76%] Built target unittests
[ 76%] Built target unittests_doublevec
make: *** [Makefile:171: all] Error 2
Cleaning up file based variables
ERROR: Job failed: exit status 1
failed
build-debug-gcc-cpp17-qt6.1.2 -nopython Build
  and include dir) to build with QT.  Note that this error is also shown if
not all required qt modules were found, e.g. Qt5Script.


-- Configuring incomplete, errors occurred!
See also "/local-hdd/gitlab-runner/builds/9582e0e8/1/OpenFlipper-Free/OpenFlipper-Free/build-debug-gcc-cpp17-nopython/CMakeFiles/CMakeOutput.log".
See also "/local-hdd/gitlab-runner/builds/9582e0e8/1/OpenFlipper-Free/OpenFlipper-Free/build-debug-gcc-cpp17-nopython/CMakeFiles/CMakeError.log".
Cleaning up file based variables
ERROR: Job failed: exit status 1
failed
build-debug-clang-cpp17-qt6.1.2 Build
  and include dir) to build with QT.  Note that this error is also shown if
not all required qt modules were found, e.g. Qt5Script.


-- Configuring incomplete, errors occurred!
See also "/local-hdd/gitlab-runner/builds/9582e0e8/1/OpenFlipper-Free/OpenFlipper-Free/build-debug-clang-cpp17/CMakeFiles/CMakeOutput.log".
See also "/local-hdd/gitlab-runner/builds/9582e0e8/1/OpenFlipper-Free/OpenFlipper-Free/build-debug-clang-cpp17/CMakeFiles/CMakeError.log".
Cleaning up file based variables
ERROR: Job failed: exit status 1
failed
build-debug-clang-cpp17-qt6.1.2 -nopython Build
  and include dir) to build with QT.  Note that this error is also shown if
not all required qt modules were found, e.g. Qt5Script.


-- Configuring incomplete, errors occurred!
See also "/local/gitlab-runner/builds/Xqxo6jru/0/OpenFlipper-Free/OpenFlipper-Free/build-debug-clang-cpp17-nopython/CMakeFiles/CMakeOutput.log".
See also "/local/gitlab-runner/builds/Xqxo6jru/0/OpenFlipper-Free/OpenFlipper-Free/build-debug-clang-cpp17-nopython/CMakeFiles/CMakeError.log".
Cleaning up file based variables
ERROR: Job failed: exit status 1
failed
Mac-Cpp11 Build
        virtual void canceledJob (QString _job ) {};
^
1 warning generated.
1 warning generated.
[ 69%] Linking CXX shared module libPlugin-Decimater.so
[ 69%] Built target Plugin-Decimater
make: *** [all] Error 2
Cleaning up file based variables
ERROR: Job failed: exit status 1
failed
build-release-gcc-cpp17-qt5.12.2-nopython Build
[ 75%] Linking CXX executable ../../../../../Unittests/unittests
[ 75%] Linking CXX shared module ../../Build/lib/plugins/libPlugin-SelectionMeshObject.so
[ 75%] Built target Plugin-SelectionMeshObject
[ 75%] Built target unittests
[ 75%] Linking CXX executable ../../../../../Unittests/unittests_customvec
[ 75%] Built target unittests_customvec
make: *** [Makefile:171: all] Error 2
Cleaning up file based variables
ERROR: Job failed: exit status 1
failed
build-release-gcc-cpp17-qt5.13.0-nopython Build
[ 77%] Linking CXX shared module ../Build/lib/plugins/libPlugin-Remesher.so
[ 77%] Built target Plugin-Remesher
[ 77%] Linking CXX executable ../../../../../Unittests/unittests_customvec
[ 77%] Built target unittests_customvec
[ 78%] Linking CXX executable ../../../../../Unittests/unittests
[ 78%] Built target unittests
make: *** [Makefile:171: all] Error 2
Cleaning up file based variables
ERROR: Job failed: exit status 1
failed
build-release-gcc-cpp17-qt6.0.4 Build
  and include dir) to build with QT.  Note that this error is also shown if
not all required qt modules were found, e.g. Qt5Script.


-- Configuring incomplete, errors occurred!
See also "/local-hdd/gitlab-runner/builds-1/db2a6fb6/0/OpenFlipper-Free/OpenFlipper-Free/build-release-gcc-cpp17/CMakeFiles/CMakeOutput.log".
See also "/local-hdd/gitlab-runner/builds-1/db2a6fb6/0/OpenFlipper-Free/OpenFlipper-Free/build-release-gcc-cpp17/CMakeFiles/CMakeError.log".
Cleaning up file based variables
ERROR: Job failed: exit status 1
failed
build-debug-gcc-cpp17-qt6.1.2 Build
  and include dir) to build with QT.  Note that this error is also shown if
not all required qt modules were found, e.g. Qt5Script.


-- Configuring incomplete, errors occurred!
See also "/local-hdd/gitlab-runner/builds-1/db2a6fb6/0/OpenFlipper-Free/OpenFlipper-Free/build-debug-gcc-cpp17/CMakeFiles/CMakeOutput.log".
See also "/local-hdd/gitlab-runner/builds-1/db2a6fb6/0/OpenFlipper-Free/OpenFlipper-Free/build-debug-gcc-cpp17/CMakeFiles/CMakeError.log".
Cleaning up file based variables
ERROR: Job failed: exit status 1
failed
build-release-gcc-cpp17-qt6.1.2 Build
  and include dir) to build with QT.  Note that this error is also shown if
not all required qt modules were found, e.g. Qt5Script.


-- Configuring incomplete, errors occurred!
See also "/local-hdd/gitlab-runner/builds-1/db2a6fb6/0/OpenFlipper-Free/OpenFlipper-Free/build-release-gcc-cpp17/CMakeFiles/CMakeOutput.log".
See also "/local-hdd/gitlab-runner/builds-1/db2a6fb6/0/OpenFlipper-Free/OpenFlipper-Free/build-release-gcc-cpp17/CMakeFiles/CMakeError.log".
Cleaning up file based variables
ERROR: Job failed: exit status 1
failed
build-release-gcc-cpp17-qt6.1.2 -nopython Build
  and include dir) to build with QT.  Note that this error is also shown if
not all required qt modules were found, e.g. Qt5Script.


-- Configuring incomplete, errors occurred!
See also "/local/gitlab-runner/builds/Xqxo6jru/0/OpenFlipper-Free/OpenFlipper-Free/build-release-gcc-cpp17-nopython/CMakeFiles/CMakeOutput.log".
See also "/local/gitlab-runner/builds/Xqxo6jru/0/OpenFlipper-Free/OpenFlipper-Free/build-release-gcc-cpp17-nopython/CMakeFiles/CMakeError.log".
Cleaning up file based variables
ERROR: Job failed: exit status 1
failed
test-debug-gcc-cpp17-qt5.15.1 Test
	  3 - AllTestsIn_OpenMesh_tests_with_minimal_vector (Failed)
4 - AllTestsIn_OpenMesh_tests_with_double_vector (Failed)
10 - PLUGIN-SMOOTHER-smoother_c0_normal_10.ofs-cube_sharp.off (Failed)
11 - PLUGIN-SMOOTHER-smoother_c0_normal_10.ofp-cube_sharp.off (Failed)
Errors while running CTest
Return Code: 8
-----------------------
Cleaning up file based variables
ERROR: Job failed: exit status 1
failed
test-debug-clang-cpp17-qt5.15.1 Test

The following tests FAILED:
7 - PLUGIN-SMOOTHER-smoother_c0_normal_10.ofs-cube_sharp.off (Failed)
8 - PLUGIN-SMOOTHER-smoother_c0_normal_10.ofp-cube_sharp.off (Failed)
Errors while running CTest
Return Code: 8
-----------------------
Cleaning up file based variables
ERROR: Job failed: exit status 1
failed
test-release-clang-cpp17-qt5.15.1 Test

The following tests FAILED:
7 - PLUGIN-SMOOTHER-smoother_c0_normal_10.ofs-cube_sharp.off (Failed)
8 - PLUGIN-SMOOTHER-smoother_c0_normal_10.ofp-cube_sharp.off (Failed)
Errors while running CTest
Return Code: 8
-----------------------
Cleaning up file based variables
ERROR: Job failed: exit status 1
failed
build-release-clang-cpp17-qt6.1.2 Build
  and include dir) to build with QT.  Note that this error is also shown if
not all required qt modules were found, e.g. Qt5Script.


-- Configuring incomplete, errors occurred!
See also "/local-hdd/gitlab-runner/builds-1/db2a6fb6/0/OpenFlipper-Free/OpenFlipper-Free/build-release-clang-cpp17/CMakeFiles/CMakeOutput.log".
See also "/local-hdd/gitlab-runner/builds-1/db2a6fb6/0/OpenFlipper-Free/OpenFlipper-Free/build-release-clang-cpp17/CMakeFiles/CMakeError.log".
Cleaning up file based variables
ERROR: Job failed: exit status 1
failed
build-release-clang-cpp17-qt6.1.2 -nopython Build
  and include dir) to build with QT.  Note that this error is also shown if
not all required qt modules were found, e.g. Qt5Script.


-- Configuring incomplete, errors occurred!
See also "/local/gitlab-runner/builds/Xqxo6jru/0/OpenFlipper-Free/OpenFlipper-Free/build-release-clang-cpp17-nopython/CMakeFiles/CMakeOutput.log".
See also "/local/gitlab-runner/builds/Xqxo6jru/0/OpenFlipper-Free/OpenFlipper-Free/build-release-clang-cpp17-nopython/CMakeFiles/CMakeError.log".
Cleaning up file based variables
ERROR: Job failed: exit status 1
failed
VS2019-Qt6.1.2-x64-NOPYTHON Build
  and include dir) to build with QT.  Note that this error is also shown if
not all required qt modules were found, e.g. Qt5Script.


-- Configuring incomplete, errors occurred!
See also "E:/gitlab/builds/mJQzyNSJ/0/OpenFlipper-Free/OpenFlipper-Free/rel/CMakeFiles/CMakeOutput.log".
See also "E:/gitlab/builds/mJQzyNSJ/0/OpenFlipper-Free/OpenFlipper-Free/rel/CMakeFiles/CMakeError.log".
Cleaning up file based variables
ERROR: Job failed: exit status 1
failed
VS2019-Qt5.15.0-x64 Build
205>--
205>-- fixup_bundle: done
205>Building Custom Rule E:/gitlab/builds/cu6mRa6g/0/OpenFlipper-Free/OpenFlipper-Free/CMakeLists.txt
205>Done building project "fixbundle.vcxproj".
206>------ Build started: Project: ALL_BUILD, Configuration: Release x64 ------
206>Building Custom Rule E:/gitlab/builds/cu6mRa6g/0/OpenFlipper-Free/OpenFlipper-Free/CMakeLists.txt
========== Build: 202 succeeded, 4 failed, 0 up-to-date, 0 skipped ==========
Cleaning up file based variables
ERROR: Job failed: exit status 1
failed
VS2019-Qt5.15.0-x64-NOPYTHON Build
205>--
205>-- fixup_bundle: done
205>Building Custom Rule E:/gitlab/builds/mJQzyNSJ/0/OpenFlipper-Free/OpenFlipper-Free/CMakeLists.txt
205>Done building project "fixbundle.vcxproj".
206>------ Build started: Project: ALL_BUILD, Configuration: Release x64 ------
206>Building Custom Rule E:/gitlab/builds/mJQzyNSJ/0/OpenFlipper-Free/OpenFlipper-Free/CMakeLists.txt
========== Build: 202 succeeded, 4 failed, 0 up-to-date, 0 skipped ==========
Cleaning up file based variables
ERROR: Job failed: exit status 1
failed
build-release-gcc-cpp17-qt5.12.2 Build
[ 76%] Built target Plugin-TypeHexahedralMesh
[ 76%] Linking CXX shared module ../../Build/lib/plugins/libPlugin-TypePolyLineCollection.so
[ 76%] Built target Plugin-TypePolyLineCollection
[ 76%] Built target unittests_customvec
[ 76%] Linking CXX executable ../../../../../Unittests/unittests_doublevec
[ 76%] Built target unittests_doublevec
make: *** [Makefile:171: all] Error 2
Cleaning up file based variables
ERROR: Job failed: exit status 1
failed
build-release-gcc-cpp17-qt5.11.2 Build
[ 75%] Linking CXX shared module ../Build/lib/plugins/libPlugin-MeshRepair.so
[ 75%] Built target Plugin-MeshConvert
[ 75%] Built target Plugin-MeshCompare
[ 75%] Built target Plugin-MeshRepair
[ 76%] Linking CXX executable ../../../../../Unittests/unittests_customvec
[ 76%] Built target unittests_customvec
make: *** [Makefile:171: all] Error 2
Cleaning up file based variables
ERROR: Job failed: exit status 1