cleanup and minor bug fixes

8 jobs for gcode_plugin
latest
Status Job ID Name Coverage
  Test
failed clang-c++11-Qt4 #5391
Linux MultiThreads

00:02:09

failed clang-c++11-Qt5 #5395
Linux MultiThreads

00:02:35

failed clang-c++98-Qt4 #5393
Linux MultiThreads

00:00:57

failed clang-c++98-Qt5 #5397
Linux MultiThreads

00:01:01

failed gcc-c++11-Qt4 #5390
Linux

00:01:19

failed gcc-c++11-Qt5 #5394
Linux

00:02:01

failed gcc-c++98-Qt4 #5392
Linux

00:00:38

failed gcc-c++98-Qt5 #5396
Linux

35:22:36

 
Name Stage Failure
failed
gcc-c++98-Qt5 Test There is an unknown failure, please try again
[ 29%] Building CXX object libs_required/OpenMesh/src/OpenMesh/Tools/CMakeFiles/OpenMeshToolsStatic.dir/Utils/Gnuplot.cc.o
[ 29%] Building CXX object libs_required/OpenMesh/src/OpenMesh/Tools/CMakeFiles/OpenMeshTools.dir/Utils/Gnuplot.cc.o
[ 29%] Linking CXX shared module ../../Build/lib/plugins/libPlugin-SelectionMeshObject.so
Scanning dependencies of target Plugin-FileHeightFieldImage
[ 29%] Building CXX object PluginCollection-FilePlugins/Plugin-FileHeightFieldImage/CMakeFiles/Plugin-FileHeightFieldImage.dir/ImageDialog.cc.o
[ 29%] Built target Plugin-SelectionMeshObject
[ 29%] Building CXX object PluginCollection-FilePlugins/Plugin-FileHeightFieldImage/CMakeFiles/Plugin-FileHeightFieldImage.dir/FileHeightFieldImage.cc.o
[ 29%] Building CXX object libs_required/OpenMesh/src/OpenMesh/Tools/CMakeFiles/OpenMeshTools.dir/Utils/conio.cc.o
[ 29%] Building CXX object libs_required/OpenMesh/src/OpenMesh/Tools/CMakeFiles/OpenMeshTools.dir/VDPM/VFront.cc.o
[ 29%] Building CXX object libs_required/OpenMesh/src/OpenMesh/Tools/CMakeFiles/OpenMeshToolsStatic.dir/Utils/conio.cc.o
failed
gcc-c++11-Qt4 Test There is an unknown failure, please try again
[ 53%] Built target Plugin-Move
[ 53%] Linking CXX shared module ../Build/lib/plugins/libPlugin-VSI.so
[ 53%] Built target Plugin-VSI
[ 53%] Linking CXX shared module ../Build/lib/plugins/libPlugin-PropertyVis.so
[ 53%] Built target Plugin-PropertyVis
Makefile:149: recipe for target 'all' failed
make: *** [all] Error 2

ERROR: Build failed: exit status 1
failed
clang-c++11-Qt4 Test There is an unknown failure, please try again
[ 41%] Built target Plugin-MeshRepair
[ 41%] Linking CXX shared module ../Build/lib/plugins/libPlugin-Decimater.so
[ 41%] Linking CXX shared module ../Build/lib/plugins/libPlugin-MeshCompare.so
[ 41%] Built target Plugin-Decimater
[ 41%] Built target Plugin-MeshCompare
Makefile:149: recipe for target 'all' failed
make: *** [all] Error 2

ERROR: Build failed: exit status 1
failed
gcc-c++98-Qt4 Test There is an unknown failure, please try again
[ 26%] Built target Plugin-FileOBJ
[ 26%] Linking CXX shared module ../../Build/lib/plugins/libPlugin-SelectionMeshObject.so
[ 26%] Built target Plugin-SelectionMeshObject
[ 26%] Linking CXX shared module ../../Build/lib/plugins/libPlugin-FileOVM.so
[ 26%] Built target Plugin-FileOVM
Makefile:149: recipe for target 'all' failed
make: *** [all] Error 2

ERROR: Build failed: exit status 1
failed
clang-c++98-Qt4 Test There is an unknown failure, please try again
[ 24%] Built target Plugin-FilePLY
[ 24%] Linking CXX shared module ../../Build/lib/plugins/libPlugin-FileOBJ.so
[ 24%] Built target Plugin-FileOBJ
[ 24%] Linking CXX shared module ../../Build/lib/plugins/libPlugin-FileOVM.so
[ 24%] Built target Plugin-FileOVM
Makefile:149: recipe for target 'all' failed
make: *** [all] Error 2

ERROR: Build failed: exit status 1
failed
gcc-c++11-Qt5 Test There is an unknown failure, please try again
[ 51%] Built target Plugin-ViewControl
[ 51%] Linking CXX shared module ../Build/lib/plugins/libPlugin-VSI.so
[ 51%] Built target Plugin-VSI
[ 51%] Linking CXX shared module ../Build/lib/plugins/libPlugin-HoleFilling.so
[ 51%] Built target Plugin-HoleFilling
Makefile:149: recipe for target 'all' failed
make: *** [all] Error 2

ERROR: Build failed: exit status 1
failed
clang-c++11-Qt5 Test There is an unknown failure, please try again
[ 36%] Built target Plugin-MeshRepair
[ 37%] Linking CXX shared module ../Build/lib/plugins/libPlugin-MeshCompare.so
[ 37%] Built target Plugin-MeshCompare
[ 37%] Linking CXX shared module ../Build/lib/plugins/libPlugin-Decimater.so
[ 37%] Built target Plugin-Decimater
Makefile:149: recipe for target 'all' failed
make: *** [all] Error 2

ERROR: Build failed: exit status 1
failed
clang-c++98-Qt5 Test There is an unknown failure, please try again
[ 22%] Built target Plugin-FileOFF
[ 22%] Linking CXX shared module ../../Build/lib/plugins/libPlugin-FileOVM.so
[ 22%] Built target Plugin-FileOVM
[ 22%] Linking CXX shared module ../../Build/lib/plugins/libPlugin-FileOBJ.so
[ 22%] Built target Plugin-FileOBJ
Makefile:149: recipe for target 'all' failed
make: *** [all] Error 2

ERROR: Build failed: exit status 1