Missing include

8 jobs for master
Status Name Job ID Coverage
  Test
failed clang-c++11-Qt4 #1122
Linux

00:04:28

failed clang-c++11-Qt5 #1126
Linux

00:04:22

failed clang-c++98-Qt4 #1124
Linux

00:03:48

failed clang-c++98-Qt5 #1128
Linux

00:05:41

failed gcc-c++11-Qt4 #1121
Linux

00:05:40

failed gcc-c++11-Qt5 #1125
Linux

00:07:20

failed gcc-c++98-Qt4 #1123
Linux

00:04:27

failed gcc-c++98-Qt5 #1127
Linux

00:04:58

 
Name Stage Failure
failed
gcc-c++98-Qt5 Test There is an unknown failure, please try again
<built-in>: note:   candidate expects 1 argument, 2 provided
ACG/CMakeFiles/ACG.dir/build.make:2004: recipe for target 'ACG/CMakeFiles/ACG.dir/Scenegraph/SeparatorNode.cc.o' failed
make[2]: *** [ACG/CMakeFiles/ACG.dir/Scenegraph/SeparatorNode.cc.o] Error 1
CMakeFiles/Makefile2:2271: recipe for target 'ACG/CMakeFiles/ACG.dir/all' failed
make[1]: *** [ACG/CMakeFiles/ACG.dir/all] Error 2
Makefile:137: recipe for target 'all' failed
make: *** [all] Error 2

ERROR: Build failed with: exit status 1
failed
clang-c++98-Qt5 Test There is an unknown failure, please try again
20 errors generated.
ACG/CMakeFiles/ACG.dir/build.make:1590: recipe for target 'ACG/CMakeFiles/ACG.dir/Scenegraph/SeparatorNode.cc.o' failed
make[2]: *** [ACG/CMakeFiles/ACG.dir/Scenegraph/SeparatorNode.cc.o] Error 1
CMakeFiles/Makefile2:2271: recipe for target 'ACG/CMakeFiles/ACG.dir/all' failed
make[1]: *** [ACG/CMakeFiles/ACG.dir/all] Error 2
Makefile:137: recipe for target 'all' failed
make: *** [all] Error 2

ERROR: Build failed with: exit status 1
failed
gcc-c++11-Qt4 Test There is an unknown failure, please try again
<built-in>: note:   candidate expects 1 argument, 2 provided
ACG/CMakeFiles/ACG.dir/build.make:1567: recipe for target 'ACG/CMakeFiles/ACG.dir/Scenegraph/SeparatorNode.cc.o' failed
make[2]: *** [ACG/CMakeFiles/ACG.dir/Scenegraph/SeparatorNode.cc.o] Error 1
CMakeFiles/Makefile2:2271: recipe for target 'ACG/CMakeFiles/ACG.dir/all' failed
make[1]: *** [ACG/CMakeFiles/ACG.dir/all] Error 2
Makefile:137: recipe for target 'all' failed
make: *** [all] Error 2

ERROR: Build failed with: exit status 1
failed
clang-c++11-Qt4 Test There is an unknown failure, please try again
20 errors generated.
ACG/CMakeFiles/ACG.dir/build.make:2004: recipe for target 'ACG/CMakeFiles/ACG.dir/Scenegraph/SeparatorNode.cc.o' failed
make[2]: *** [ACG/CMakeFiles/ACG.dir/Scenegraph/SeparatorNode.cc.o] Error 1
CMakeFiles/Makefile2:2271: recipe for target 'ACG/CMakeFiles/ACG.dir/all' failed
make[1]: *** [ACG/CMakeFiles/ACG.dir/all] Error 2
Makefile:137: recipe for target 'all' failed
make: *** [all] Error 2

ERROR: Build failed with: exit status 1
failed
gcc-c++98-Qt4 Test There is an unknown failure, please try again
<built-in>: note:   candidate expects 1 argument, 2 provided
ACG/CMakeFiles/ACG.dir/build.make:2119: recipe for target 'ACG/CMakeFiles/ACG.dir/Scenegraph/SeparatorNode.cc.o' failed
make[2]: *** [ACG/CMakeFiles/ACG.dir/Scenegraph/SeparatorNode.cc.o] Error 1
CMakeFiles/Makefile2:2271: recipe for target 'ACG/CMakeFiles/ACG.dir/all' failed
make[1]: *** [ACG/CMakeFiles/ACG.dir/all] Error 2
Makefile:137: recipe for target 'all' failed
make: *** [all] Error 2

ERROR: Build failed with: exit status 1
failed
clang-c++98-Qt4 Test There is an unknown failure, please try again
20 errors generated.
ACG/CMakeFiles/ACG.dir/build.make:2142: recipe for target 'ACG/CMakeFiles/ACG.dir/Scenegraph/SeparatorNode.cc.o' failed
make[2]: *** [ACG/CMakeFiles/ACG.dir/Scenegraph/SeparatorNode.cc.o] Error 1
CMakeFiles/Makefile2:2271: recipe for target 'ACG/CMakeFiles/ACG.dir/all' failed
make[1]: *** [ACG/CMakeFiles/ACG.dir/all] Error 2
Makefile:137: recipe for target 'all' failed
make: *** [all] Error 2

ERROR: Build failed with: exit status 1
failed
gcc-c++11-Qt5 Test There is an unknown failure, please try again
<built-in>: note:   candidate expects 1 argument, 2 provided
ACG/CMakeFiles/ACG.dir/build.make:2142: recipe for target 'ACG/CMakeFiles/ACG.dir/Scenegraph/SeparatorNode.cc.o' failed
make[2]: *** [ACG/CMakeFiles/ACG.dir/Scenegraph/SeparatorNode.cc.o] Error 1
CMakeFiles/Makefile2:2271: recipe for target 'ACG/CMakeFiles/ACG.dir/all' failed
make[1]: *** [ACG/CMakeFiles/ACG.dir/all] Error 2
Makefile:137: recipe for target 'all' failed
make: *** [all] Error 2

ERROR: Build failed with: exit status 1
failed
clang-c++11-Qt5 Test There is an unknown failure, please try again
20 errors generated.
ACG/CMakeFiles/ACG.dir/build.make:1475: recipe for target 'ACG/CMakeFiles/ACG.dir/Scenegraph/SeparatorNode.cc.o' failed
make[2]: *** [ACG/CMakeFiles/ACG.dir/Scenegraph/SeparatorNode.cc.o] Error 1
CMakeFiles/Makefile2:2271: recipe for target 'ACG/CMakeFiles/ACG.dir/all' failed
make[1]: *** [ACG/CMakeFiles/ACG.dir/all] Error 2
Makefile:137: recipe for target 'all' failed
make: *** [all] Error 2

ERROR: Build failed with: exit status 1