fix empty viewport

9 jobs for supersampling in 66 minutes and 7 seconds (queued for 1 second)
latest
Status Job ID Name Coverage
  Test
failed clang-c++11-Qt4 #9545
Linux MultiThreads

00:05:15

failed clang-c++11-Qt5 #9549
Linux MultiThreads

00:06:15

failed clang-c++98-Qt4 #9547
Linux MultiThreads

00:02:23

failed clang-c++98-Qt5 #9551
Linux MultiThreads

00:04:50

passed cppcheck #9552
Linux MultiThreads

00:36:00

failed gcc-c++11-Qt4 #9544
Linux

00:02:55

failed gcc-c++11-Qt5 #9548
Linux

00:03:05

failed gcc-c++98-Qt4 #9546
Linux

00:02:31

failed gcc-c++98-Qt5 #9550
Linux

00:02:48

 
Name Stage Failure
failed
gcc-c++11-Qt4 Test There is an unknown failure, please try again
[ 73%] Building CXX object libs_required/OpenMesh/src/Unittests/CMakeFiles/unittests.dir/unittests_trimesh_circulator_current_halfedge_handle_replacement.cc.o
[ 73%] Building CXX object libs_required/OpenMesh/src/Unittests/CMakeFiles/unittests.dir/unittests_faceless_mesh.cc.o
[ 74%] Linking CXX executable ../../../../Unittests/unittests
[ 74%] Built target unittests
[ 74%] Linking CXX shared library ../../../../Build/python/openmesh.so
[ 74%] Built target openmesh
Makefile:149: recipe for target 'all' failed
make: *** [all] Error 2
ERROR: Build failed: exit status 1
failed
clang-c++11-Qt4 Test There is an unknown failure, please try again
1 warning generated.
[ 73%] Linking CXX shared library ../../../../Build/python/openmesh.so
[ 73%] Building CXX object libs_required/OpenMesh/src/Unittests/CMakeFiles/unittests.dir/unittests_trimesh_circulator_vertex_face.cc.o
[ 73%] Built target openmesh
[ 74%] Linking CXX executable ../../../../Unittests/unittests
[ 74%] Built target unittests
Makefile:149: recipe for target 'all' failed
make: *** [all] Error 2
ERROR: Build failed: exit status 1
failed
gcc-c++98-Qt4 Test There is an unknown failure, please try again
[ 72%] Building CXX object libs_required/OpenMesh/src/Unittests/CMakeFiles/unittests.dir/unittests_trimesh_circulator_vertex_vertex.cc.o
[ 72%] Building CXX object libs_required/OpenMesh/src/Unittests/CMakeFiles/unittests.dir/unittests.cc.o
[ 73%] Linking CXX executable ../../../../Unittests/unittests
[ 73%] Built target unittests
[ 73%] Linking CXX shared library ../../../../Build/python/openmesh.so
[ 73%] Built target openmesh
Makefile:149: recipe for target 'all' failed
make: *** [all] Error 2
ERROR: Build failed: exit status 1
failed
clang-c++98-Qt4 Test There is an unknown failure, please try again
[ 41%] Building CXX object libs_required/OpenMesh/src/Unittests/CMakeFiles/unittests.dir/unittests_trimesh_circulator_face_face.cc.o
[ 41%] Building CXX object libs_required/OpenMesh/src/Unittests/CMakeFiles/unittests.dir/unittests_polymesh_vec2i.cc.o
[ 41%] Building CXX object libs_required/OpenMesh/src/Unittests/CMakeFiles/unittests.dir/unittests_trimesh_circulator_current_halfedge_handle_replacement.cc.o
[ 41%] Building CXX object libs_required/OpenMesh/src/Unittests/CMakeFiles/unittests.dir/unittests_property.cc.o
[ 42%] Linking CXX executable ../../../../Unittests/unittests
[ 42%] Built target unittests
Makefile:149: recipe for target 'all' failed
make: *** [all] Error 2
ERROR: Build failed: exit status 1
failed
gcc-c++11-Qt5 Test There is an unknown failure, please try again
make[1]: *** [ACG/CMakeFiles/ACG.dir/all] Error 2
make[1]: *** Waiting for unfinished jobs....
[ 74%] Linking CXX executable ../../../../Unittests/unittests
[ 74%] Built target unittests
[ 75%] Linking CXX shared library ../../../../Build/python/openmesh.so
[ 75%] Built target openmesh
Makefile:149: recipe for target 'all' failed
make: *** [all] Error 2
ERROR: Build failed: exit status 1
failed
clang-c++11-Qt5 Test There is an unknown failure, please try again
[ 73%] Building CXX object libs_required/OpenMesh/src/Unittests/CMakeFiles/unittests.dir/unittests_trimesh_circulator_face_face.cc.o
[ 73%] Building CXX object libs_required/OpenMesh/src/Unittests/CMakeFiles/unittests.dir/unittests_polymesh_vec2i.cc.o
[ 73%] Building CXX object libs_required/OpenMesh/src/Unittests/CMakeFiles/unittests.dir/unittests_trimesh_circulator_current_halfedge_handle_replacement.cc.o
[ 73%] Building CXX object libs_required/OpenMesh/src/Unittests/CMakeFiles/unittests.dir/unittests_property.cc.o
[ 74%] Linking CXX executable ../../../../Unittests/unittests
[ 74%] Built target unittests
Makefile:149: recipe for target 'all' failed
make: *** [all] Error 2
ERROR: Build failed: exit status 1
failed
gcc-c++98-Qt5 Test There is an unknown failure, please try again
[ 72%] Linking CXX executable ../../../../Unittests/unittests
[ 72%] Built target unittests
[ 72%] Linking CXX shared module ../Build/lib/plugins/libPlugin-PropertyVis.so
[ 72%] Built target Plugin-PropertyVis
[ 73%] Linking CXX shared library ../../../../Build/python/openmesh.so
[ 73%] Built target openmesh
Makefile:149: recipe for target 'all' failed
make: *** [all] Error 2
ERROR: Build failed: exit status 1
failed
clang-c++98-Qt5 Test There is an unknown failure, please try again
[ 72%] Building CXX object libs_required/OpenMesh/src/Unittests/CMakeFiles/unittests.dir/unittests_property.cc.o
1 warning generated.
[ 73%] Linking CXX shared library ../../../../Build/python/openmesh.so
[ 73%] Built target openmesh
[ 74%] Linking CXX executable ../../../../Unittests/unittests
[ 74%] Built target unittests
Makefile:149: recipe for target 'all' failed
make: *** [all] Error 2
ERROR: Build failed: exit status 1