add missing picking shader file

7 jobs for CameraNode in 39 minutes and 58 seconds
Name Stage Failure
failed
VS2015-Qt-5.6.0-x32 Test There is an unknown failure, please try again
174>  Call Stack (most recent call first):
174> fixbundle.win.cmake:34 (fixup_bundle)
174>
174>
175>------ Build started: Project: ALL_BUILD, Configuration: Release Win32 ------
175> Building Custom Rule E:/gitlab/builds/1900f1de/0/OpenFlipper-Free/OpenFlipper-Free/CMakeLists.txt
175> CMake does not need to re-run because E:\gitlab\builds\1900f1de\0\OpenFlipper-Free\OpenFlipper-Free\rel\CMakeFiles\generate.stamp is up-to-date.
========== Build: 76 succeeded, 99 failed, 0 up-to-date, 0 skipped ==========
ERROR: Build failed: exit status 1
failed
Mac-Cpp11 Test There is an unknown failure, please try again
             ^
1 error generated.
make[3]: *** [OpenFlipper/PluginLib/CMakeFiles/OpenFlipperPluginLib.dir/__/__/ObjectTypes/HexahedralMesh/PluginFunctionsHexahedralMesh.cc.o] Error 1
make[2]: *** [OpenFlipper/PluginLib/CMakeFiles/OpenFlipperPluginLib.dir/all] Error 2
make[1]: *** [CMakeFiles/OpenFlipper_package.dir/rule] Error 2
make: *** [OpenFlipper_package] Error 2
mv: rename *.dmg to OpenFlipper-Free-GIT-d8b7f759abfb12090bb4a40b231eaa72a7d4269c-QT5.5.1-CPP11.dmg: No such file or directory

ERROR: Build failed: exit status 1
failed
cppcheck Test There is an unknown failure, please try again

==============================================================================
CPPCHECK Summary
==============================================================================


Total CPPCHECK error Count is 41, which is too High! CPPCHECK Run failed

ERROR: Build failed: exit status 1
failed
gcc-c++11-Qt5 Test There is an unknown failure, please try again
CMakeFiles/Makefile2:8689: recipe for target 'PluginCollection-TypePlugins/Plugin-TypePolyhedralMesh/CMakeFiles/Plugin-TypePolyhedralMesh.dir/all' failed
make[1]: *** [PluginCollection-TypePlugins/Plugin-TypePolyhedralMesh/CMakeFiles/Plugin-TypePolyhedralMesh.dir/all] Error 2
[ 29%] Linking CXX shared module ../../Build/lib/plugins/libPlugin-Render-Picking.so
[ 29%] Built target Plugin-Render-Picking
[ 29%] Linking CXX shared module ../../Build/lib/plugins/libPlugin-SelectionMeshObject.so
[ 29%] Built target Plugin-SelectionMeshObject
Makefile:149: recipe for target 'all' failed
make: *** [all] Error 2
ERROR: Build failed: exit status 1
failed
clang-c++11-Qt5 Test There is an unknown failure, please try again
make[2]: *** Waiting for unfinished jobs....
1 error generated.
Plugin-TextureControl/CMakeFiles/Plugin-TextureControl.dir/build.make:299: recipe for target 'Plugin-TextureControl/CMakeFiles/Plugin-TextureControl.dir/moc_TextureControl.cpp.o' failed
make[2]: *** [Plugin-TextureControl/CMakeFiles/Plugin-TextureControl.dir/moc_TextureControl.cpp.o] Error 1
CMakeFiles/Makefile2:6674: recipe for target 'Plugin-TextureControl/CMakeFiles/Plugin-TextureControl.dir/all' failed
make[1]: *** [Plugin-TextureControl/CMakeFiles/Plugin-TextureControl.dir/all] Error 2
Makefile:149: recipe for target 'all' failed
make: *** [all] Error 2
ERROR: Build failed: exit status 1
failed
VS2015-Qt-5.6.0-x64 Test There is an unknown failure, please try again
174>  Call Stack (most recent call first):
174> fixbundle.win.cmake:34 (fixup_bundle)
174>
174>
175>------ Build started: Project: ALL_BUILD, Configuration: Release x64 ------
175> Building Custom Rule E:/gitlab/builds/7949bd93/0/OpenFlipper-Free/OpenFlipper-Free/CMakeLists.txt
175> CMake does not need to re-run because E:\gitlab\builds\7949bd93\0\OpenFlipper-Free\OpenFlipper-Free\rel\CMakeFiles\generate.stamp is up-to-date.
========== Build: 76 succeeded, 99 failed, 0 up-to-date, 0 skipped ==========
ERROR: Build failed: exit status 1