Missing header

7 jobs for master in 22 minutes and 5 seconds (queued for 1 second)
Status Name Job ID Coverage
  Test
passed clang-c++11 #10238
Linux

00:22:02

failed clang-c++98 #10240
Linux

00:04:02

passed cppcheck #10243
Linux

00:00:32

passed gcc-c++11 #10237
Linux

00:05:38

failed gcc-c++98 #10239
Linux

00:00:30

passed macos-c++11 #10241
Apple

00:16:32

passed macos-c++98 #10242
Apple

00:15:26

 
Name Stage Failure
failed
gcc-c++98 Test There is an unknown failure, please try again
[ 78%] Built target ProgViewer
CMakeFiles/Makefile2:1088: recipe for target 'src/Unittests/CMakeFiles/unittests.dir/all' failed
make[1]: *** [src/Unittests/CMakeFiles/unittests.dir/all] Error 2
make[1]: *** Waiting for unfinished jobs....
[ 78%] Linking CXX executable ../../../../Build/bin/QtViewer
[ 78%] Built target QtViewer
Makefile:149: recipe for target 'all' failed
make: *** [all] Error 2
ERROR: Build failed: exit status 1
failed
clang-c++98 Test There is an unknown failure, please try again
 ^
1 error generated.
src/Unittests/CMakeFiles/unittests.dir/build.make:86: recipe for target 'src/Unittests/CMakeFiles/unittests.dir/unittests_vector_type.cc.o' failed
make[2]: *** [src/Unittests/CMakeFiles/unittests.dir/unittests_vector_type.cc.o] Error 1
CMakeFiles/Makefile2:1088: recipe for target 'src/Unittests/CMakeFiles/unittests.dir/all' failed
make[1]: *** [src/Unittests/CMakeFiles/unittests.dir/all] Error 2
Makefile:149: recipe for target 'all' failed
make: *** [all] Error 2
ERROR: Build failed: exit status 1