attempt to quench 'Checked Iterator' warnings in VS2015

37 jobs for checked-iterators-fix in 44 minutes and 16 seconds (queued for 1 second)
Status Name Job ID Coverage
  Test
failed clang-c++11 #16818
Linux

00:10:23

passed clang-c++98 #16782
Linux

00:16:41

passed cppcheck #16785
Linux

00:00:26

failed gcc-c++11 #16814
Linux

00:01:23

passed gcc-c++98 #16781
Linux

00:06:43

failed macos-c++11 #16820
Apple

00:06:58

passed macos-c++98 #16784
Apple

00:15:26

canceled VS2013-32-bit-shared-apps #16811
VS2013

passed VS2013-32-bit-shared-no-apps #16797
VS2013

00:03:36

canceled VS2013-32-bit-static-apps #16809
VS2013

00:00:10

passed VS2013-32-bit-static-no-apps #16801
VS2013

00:03:58

passed VS2013-64-bit-shared-apps #16794
VS2013

00:05:09

passed VS2013-64-bit-shared-no-apps #16795
VS2013

00:03:57

canceled VS2013-64-bit-static-apps #16810
VS2013

passed VS2013-64-bit-static-no-apps #16799
VS2013

00:04:15

canceled VS2015-32-bit-shared-apps #16817
VS2015

canceled VS2015-32-bit-shared-no-apps #16819
VS2015

canceled VS2015-32-bit-static-apps #16812
VS2015

canceled VS2015-32-bit-static-no-apps #16813
VS2015

canceled VS2015-64-bit-shared-apps #16821
VS2015

canceled VS2015-64-bit-shared-no-apps #16822
VS2015

canceled VS2015-64-bit-static-apps #16815
VS2015

canceled VS2015-64-bit-static-no-apps #16816
VS2015

failed clang-c++11 #16780
Linux

00:10:22

failed gcc-c++11 #16779
Linux

00:15:02

failed macos-c++11 #16783
Apple

00:06:58

failed VS2013-32-bit-shared-apps #16796
VS2013

00:03:49

failed VS2013-32-bit-static-apps #16800
VS2013

00:04:11

failed VS2013-64-bit-static-apps #16798
VS2013

00:04:10

failed VS2015-32-bit-shared-apps #16788
VS2015

00:04:40

failed VS2015-32-bit-shared-no-apps #16789
VS2015

00:03:36

failed VS2015-32-bit-static-apps #16792
VS2015

00:04:21

failed VS2015-32-bit-static-no-apps #16793
VS2015

00:03:37

failed VS2015-64-bit-shared-apps #16786
VS2015

00:04:28

failed VS2015-64-bit-shared-no-apps #16787
VS2015

00:03:48

failed VS2015-64-bit-static-apps #16790
VS2015

00:04:36

failed VS2015-64-bit-static-no-apps #16791
VS2015

00:03:51

 
Name Stage Failure
failed
gcc-c++11 Test There is an unknown failure, please try again
[==========] 188 tests from 52 test cases ran. (5556 ms total)
[ PASSED ] 185 tests.
[ FAILED ] 3 tests, listed below:
[ FAILED ] OpenMesh_Triangle.cpp11_initializer_test
[ FAILED ] OpenMeshVectorTest.BasicLinearAlgebra
[ FAILED ] OpenMeshOthers.CalcDihedralAngre

3 FAILED TESTS
ERROR: Build failed: exit status 1
failed
clang-c++11 Test There is an unknown failure, please try again
[==========] 188 tests from 52 test cases ran. (7036 ms total)
[ PASSED ] 185 tests.
[ FAILED ] 3 tests, listed below:
[ FAILED ] OpenMeshVectorTest.BasicLinearAlgebra
[ FAILED ] OpenMesh_Triangle.cpp11_initializer_test
[ FAILED ] OpenMeshOthers.CalcDihedralAngre

3 FAILED TESTS
ERROR: Build failed: exit status 1
failed
macos-c++11 Test There is an unknown failure, please try again
[  PASSED  ] 185 tests.
[ FAILED ] 3 tests, listed below:
[ FAILED ] OpenMesh_Triangle.cpp11_initializer_test
[ FAILED ] OpenMeshOthers.CalcDihedralAngre
[ FAILED ] OpenMeshVectorTest.BasicLinearAlgebra

3 FAILED TESTS

ERROR: Build failed: exit status 1