add Midpoint uniform subdivision scheme

23 jobs for midpoint-subdivision in 40 minutes and 51 seconds
Status Name Job ID Coverage
  Test
passed clang-c++11 #21595
Linux

00:21:12

failed clang-c++98 #21597
Linux

00:01:35

passed cppcheck #21600
Linux

00:00:27

passed gcc-c++11 #21594
Linux

00:05:03

failed gcc-c++98 #21596
Linux

00:00:26

passed macos-c++11 #21598
Apple

00:09:36

passed macos-c++98 #21599
Apple

00:08:56

passed VS2013-32-bit-shared-apps #21611
VS2013

00:04:36

passed VS2013-32-bit-shared-no-apps #21612
VS2013

00:03:37

passed VS2013-32-bit-static-apps #21615
VS2013

00:04:33

passed VS2013-32-bit-static-no-apps #21616
VS2013

00:03:45

passed VS2013-64-bit-shared-apps #21609
VS2013

00:05:00

passed VS2013-64-bit-shared-no-apps #21610
VS2013

00:03:57

passed VS2013-64-bit-static-apps #21613
VS2013

00:04:58

passed VS2013-64-bit-static-no-apps #21614
VS2013

00:04:09

passed VS2015-32-bit-shared-apps #21603
VS2015

00:06:05

passed VS2015-32-bit-shared-no-apps #21604
VS2015

00:04:32

passed VS2015-32-bit-static-apps #21607
VS2015

00:05:27

passed VS2015-32-bit-static-no-apps #21608
VS2015

00:04:56

passed VS2015-64-bit-shared-apps #21601
VS2015

00:07:19

passed VS2015-64-bit-shared-no-apps #21602
VS2015

00:05:13

passed VS2015-64-bit-static-apps #21605
VS2015

00:06:57

passed VS2015-64-bit-static-no-apps #21606
VS2015

00:05:22

 
Name Stage Failure
failed
gcc-c++98 Test There is an unknown failure, please try again
/local/gitlab-runner/builds/63e68e74/1/OpenMesh/OpenMesh/src/OpenMesh/Apps/Decimating/DecimaterGui/../../../../OpenMesh/Core/Mesh/PolyMeshT.hh:418:50: error: 'vh1' was not declared in this scope
ICECC[38755] 17:31:29: Compiled on 137.226.115.68
src/OpenMesh/Apps/Decimating/DecimaterGui/CMakeFiles/DecimaterGui.dir/build.make:122: recipe for target 'src/OpenMesh/Apps/Decimating/DecimaterGui/CMakeFiles/DecimaterGui.dir/__/decimaterviewer.cc.o' failed
make[2]: *** [src/OpenMesh/Apps/Decimating/DecimaterGui/CMakeFiles/DecimaterGui.dir/__/decimaterviewer.cc.o] Error 1
CMakeFiles/Makefile2:808: recipe for target 'src/OpenMesh/Apps/Decimating/DecimaterGui/CMakeFiles/DecimaterGui.dir/all' failed
make[1]: *** [src/OpenMesh/Apps/Decimating/DecimaterGui/CMakeFiles/DecimaterGui.dir/all] Error 2
Makefile:149: recipe for target 'all' failed
make: *** [all] Error 2
ERROR: Build failed: exit status 1
failed
clang-c++98 Test There is an unknown failure, please try again
                                          ^
2 warnings and 2 errors generated.
src/OpenMesh/Apps/Subdivider/commandlineSubdivider/CMakeFiles/commandlineSubdivider.dir/build.make:62: recipe for target 'src/OpenMesh/Apps/Subdivider/commandlineSubdivider/CMakeFiles/commandlineSubdivider.dir/__/subdivider.cc.o' failed
make[2]: *** [src/OpenMesh/Apps/Subdivider/commandlineSubdivider/CMakeFiles/commandlineSubdivider.dir/__/subdivider.cc.o] Error 1
CMakeFiles/Makefile2:528: recipe for target 'src/OpenMesh/Apps/Subdivider/commandlineSubdivider/CMakeFiles/commandlineSubdivider.dir/all' failed
make[1]: *** [src/OpenMesh/Apps/Subdivider/commandlineSubdivider/CMakeFiles/commandlineSubdivider.dir/all] Error 2
Makefile:149: recipe for target 'all' failed
make: *** [all] Error 2
ERROR: Build failed: exit status 1