Polymesh version for midpoint

23 jobs for midpoint_unittest in 13 minutes and 1 second (queued for 2 seconds)
Status Name Job ID Coverage
  Test
failed clang-c++11 #21927
Linux

00:04:29

failed clang-c++98 #21929
Linux

00:08:14

passed cppcheck #21932
Linux

00:00:24

failed gcc-c++11 #21926
Linux

00:00:51

failed gcc-c++98 #21928
Linux

00:00:52

failed macos-c++11 #21930
Apple

00:02:27

failed macos-c++98 #21931
Apple

00:02:17

canceled VS2013-32-bit-shared-apps #21943
VS2013

canceled VS2013-32-bit-shared-no-apps #21944
VS2013

canceled VS2013-32-bit-static-apps #21947
VS2013

canceled VS2013-32-bit-static-no-apps #21948
VS2013

canceled VS2013-64-bit-shared-apps #21941
VS2013

canceled VS2013-64-bit-shared-no-apps #21942
VS2013

canceled VS2013-64-bit-static-apps #21945
VS2013

canceled VS2013-64-bit-static-no-apps #21946
VS2013

canceled VS2015-32-bit-shared-apps #21935
VS2015

canceled VS2015-32-bit-shared-no-apps #21936
VS2015

canceled VS2015-32-bit-static-apps #21939
VS2015

canceled VS2015-32-bit-static-no-apps #21940
VS2015

canceled VS2015-64-bit-shared-apps #21933
VS2015

canceled VS2015-64-bit-shared-no-apps #21934
VS2015

canceled VS2015-64-bit-static-apps #21937
VS2015

canceled VS2015-64-bit-static-no-apps #21938
VS2015

 
Name Stage Failure
failed
gcc-c++11 Test There is an unknown failure, please try again
make[2]: *** [src/Unittests/CMakeFiles/unittests.dir/unittests_subdivider_uniform.cc.o] Error 1
make[2]: *** Waiting for unfinished jobs....
[ 83%] Linking CXX executable ../../../../../Build/bin/DecimaterGui
[ 83%] Built target DecimaterGui
CMakeFiles/Makefile2:1088: recipe for target 'src/Unittests/CMakeFiles/unittests.dir/all' failed
make[1]: *** [src/Unittests/CMakeFiles/unittests.dir/all] Error 2
Makefile:149: recipe for target 'all' failed
make: *** [all] Error 2
ERROR: Build failed: exit status 1
failed
clang-c++11 Test There is an unknown failure, please try again
                         ^
1 error generated.
src/Unittests/CMakeFiles/unittests.dir/build.make:62: recipe for target 'src/Unittests/CMakeFiles/unittests.dir/unittests_subdivider_uniform.cc.o' failed
make[2]: *** [src/Unittests/CMakeFiles/unittests.dir/unittests_subdivider_uniform.cc.o] Error 1
CMakeFiles/Makefile2:1088: recipe for target 'src/Unittests/CMakeFiles/unittests.dir/all' failed
make[1]: *** [src/Unittests/CMakeFiles/unittests.dir/all] Error 2
Makefile:149: recipe for target 'all' failed
make: *** [all] Error 2
ERROR: Build failed: exit status 1
failed
gcc-c++98 Test There is an unknown failure, please try again
ICECC[49374] 09:47:29: Compiled on 137.226.115.18
src/Unittests/CMakeFiles/unittests.dir/build.make:1022: recipe for target 'src/Unittests/CMakeFiles/unittests.dir/unittests_subdivider_uniform.cc.o' failed
make[2]: *** [src/Unittests/CMakeFiles/unittests.dir/unittests_subdivider_uniform.cc.o] Error 1
make[2]: *** Waiting for unfinished jobs....
CMakeFiles/Makefile2:1088: recipe for target 'src/Unittests/CMakeFiles/unittests.dir/all' failed
make[1]: *** [src/Unittests/CMakeFiles/unittests.dir/all] Error 2
Makefile:149: recipe for target 'all' failed
make: *** [all] Error 2
ERROR: Build failed: exit status 1
failed
clang-c++98 Test There is an unknown failure, please try again
                         ^
1 error generated.
src/Unittests/CMakeFiles/unittests.dir/build.make:1022: recipe for target 'src/Unittests/CMakeFiles/unittests.dir/unittests_subdivider_uniform.cc.o' failed
make[2]: *** [src/Unittests/CMakeFiles/unittests.dir/unittests_subdivider_uniform.cc.o] Error 1
CMakeFiles/Makefile2:1088: recipe for target 'src/Unittests/CMakeFiles/unittests.dir/all' failed
make[1]: *** [src/Unittests/CMakeFiles/unittests.dir/all] Error 2
Makefile:149: recipe for target 'all' failed
make: *** [all] Error 2
ERROR: Build failed: exit status 1
failed
macos-c++11 Test There is an unknown failure, please try again
/Users/jenkins/gitlab-runner/builds/8dfb9a4a/0/OpenMesh/OpenMesh/src/Unittests/../OpenMesh/Tools/Subdivider/Uniform/SubdividerT.hh:137:26: note: passing argument to parameter '_m' here
bool attach( MeshType& _m )
^
1 error generated.
make[2]: *** [src/Unittests/CMakeFiles/unittests.dir/unittests_subdivider_uniform.cc.o] Error 1
make[1]: *** [src/Unittests/CMakeFiles/unittests.dir/all] Error 2
make: *** [all] Error 2

ERROR: Build failed: exit status 1
failed
macos-c++98 Test There is an unknown failure, please try again
/Users/jenkins/gitlab-runner/builds/8dfb9a4a/0/OpenMesh/OpenMesh/src/Unittests/../OpenMesh/Tools/Subdivider/Uniform/SubdividerT.hh:137:26: note: passing argument to parameter '_m' here
bool attach( MeshType& _m )
^
1 error generated.
make[2]: *** [src/Unittests/CMakeFiles/unittests.dir/unittests_subdivider_uniform.cc.o] Error 1
make[1]: *** [src/Unittests/CMakeFiles/unittests.dir/all] Error 2
make: *** [all] Error 2

ERROR: Build failed: exit status 1