Merge branch 'python_strip_string_fix' into 'master'

fix the stripping of the python libs version string

See merge request !122
31 jobs for master in 73 minutes and 39 seconds (queued for 29 seconds)
Status Name Job ID Coverage
  Test
passed clang-c++11 #22977
Linux

00:27:23

failed clang-c++98 #22981
Linux

00:04:07

passed cppcheck #22926
Linux

00:00:25

passed Doc-publish #22943
Linux

00:00:26

passed gcc-c++11 #22944
Linux

00:06:45

passed gcc-c++98 #22979
Linux

00:05:29

passed macos-c++11 #22924
Apple

00:09:37

passed macos-c++98 #22925
Apple

00:09:02

passed VS2013-32-bit-shared-apps #22937
VS2013

00:04:59

passed VS2013-32-bit-shared-no-apps #22938
VS2013

00:03:31

passed VS2013-32-bit-static-apps #22941
VS2013

00:04:55

passed VS2013-32-bit-static-no-apps #22942
VS2013

00:03:38

passed VS2013-64-bit-shared-apps #22935
VS2013

00:05:00

passed VS2013-64-bit-shared-no-apps #22936
VS2013

00:04:03

passed VS2013-64-bit-static-apps #22939
VS2013

00:05:00

passed VS2013-64-bit-static-no-apps #22940
VS2013

00:04:10

passed VS2015-32-bit-shared-apps #22929
VS2015

00:06:04

passed VS2015-32-bit-shared-no-apps #22930
VS2015

00:04:49

passed VS2015-32-bit-static-apps #22933
VS2015

00:06:09

passed VS2015-32-bit-static-no-apps #22934
VS2015

00:05:05

passed VS2015-64-bit-shared-apps #22927
VS2015

00:07:11

passed VS2015-64-bit-shared-no-apps #22928
VS2015

00:05:39

passed VS2015-64-bit-static-apps #22931
VS2015

00:06:56

passed VS2015-64-bit-static-no-apps #22932
VS2015

00:05:40

failed clang-c++11 #22921
Linux

00:10:08

failed clang-c++98 #22980
Linux

00:03:56

failed clang-c++98 #22978
Linux

00:01:21

failed clang-c++98 #22923
Linux

00:08:16

failed gcc-c++11 #22920
Linux

00:02:51

failed gcc-c++98 #22945
Linux

00:00:48

failed gcc-c++98 #22922
Linux

00:00:48

 
Name Stage Failure
failed
clang-c++98 Test There is an unknown failure, please try again
                                                              ^
1 warning and 1 error generated.
src/Unittests/CMakeFiles/unittests.dir/build.make:398: recipe for target 'src/Unittests/CMakeFiles/unittests.dir/unittests_property.cc.o' failed
make[2]: *** [src/Unittests/CMakeFiles/unittests.dir/unittests_property.cc.o] Error 1
CMakeFiles/Makefile2:1088: recipe for target 'src/Unittests/CMakeFiles/unittests.dir/all' failed
make[1]: *** [src/Unittests/CMakeFiles/unittests.dir/all] Error 2
Makefile:149: recipe for target 'all' failed
make: *** [all] Error 2
ERROR: Build failed: exit status 1