C++11: Fixed OpenMesh Python bindings.

6 jobs for cpp11
Status Name Job ID Coverage
  Test
passed clang-c++11 #174
Linux

00:11:59

failed clang-c++98 #176
Linux

00:04:17

passed gcc-c++11 #173
Linux

00:18:38

failed gcc-c++98 #175
Linux

00:09:17

passed macos-c++11 #177
Apple

00:06:11

failed macos-c++98 #178
Apple

00:05:25

 
Name Stage Failure
failed
macos-c++98 Test There is an unknown failure, please try again
[----------] Global test environment tear-down
[==========] 166 tests from 46 test cases ran. (13174 ms total)
[ PASSED ] 165 tests.
[ FAILED ] 1 test, listed below:
[ FAILED ] OpenMeshVectorTest.move_constructor_assignment

1 FAILED TEST

ERROR: Build failed with: exit status 1
failed
gcc-c++98 Test There is an unknown failure, please try again
CMakeFiles/Makefile2:995: recipe for target 'src/Unittests/CMakeFiles/unittests.dir/all' failed
make[2]: *** [src/Unittests/CMakeFiles/unittests.dir/all] Error 2
CMakeFiles/Makefile2:1007: recipe for target 'src/Unittests/CMakeFiles/unittests.dir/rule' failed
make[1]: *** [src/Unittests/CMakeFiles/unittests.dir/rule] Error 2
Makefile:405: recipe for target 'unittests' failed
make: *** [unittests] Error 2
CI/ci-linux.sh: line 82: ./unittests: No such file or directory

ERROR: Build failed with: exit status 1
failed
clang-c++98 Test There is an unknown failure, please try again
CMakeFiles/Makefile2:995: recipe for target 'src/Unittests/CMakeFiles/unittests.dir/all' failed
make[2]: *** [src/Unittests/CMakeFiles/unittests.dir/all] Error 2
CMakeFiles/Makefile2:1007: recipe for target 'src/Unittests/CMakeFiles/unittests.dir/rule' failed
make[1]: *** [src/Unittests/CMakeFiles/unittests.dir/rule] Error 2
Makefile:405: recipe for target 'unittests' failed
make: *** [unittests] Error 2
CI/ci-linux.sh: line 82: ./unittests: No such file or directory

ERROR: Build failed with: exit status 1