fixed independet unittest

23 jobs for 15-create-a-more-usefull-example-for-the-mesh-decimater in 84 minutes and 55 seconds (queued for 1 second)
latest
Status Job ID Name Coverage
  Test
failed clang-c++11 #28746
Linux

00:15:33

failed clang-c++98 #28748
Linux

00:04:21

failed cppcheck #28751
Linux

00:01:59

failed gcc-c++11 #28745
Linux

00:02:02

failed gcc-c++98 #28747
Linux

00:01:08

passed macos-c++11 #28749
Apple

00:09:41

passed macos-c++98 #28750
Apple

00:09:02

passed VS2013-32-bit-shared-apps #28762
VS2013

00:05:03

passed VS2013-32-bit-shared-no-apps #28763
VS2013

00:03:44

passed VS2013-32-bit-static-apps #28766
VS2013

00:04:59

passed VS2013-32-bit-static-no-apps #28767
VS2013

00:03:51

passed VS2013-64-bit-shared-apps #28760
VS2013

00:05:30

passed VS2013-64-bit-shared-no-apps #28761
VS2013

00:04:03

passed VS2013-64-bit-static-apps #28764
VS2013

00:05:28

passed VS2013-64-bit-static-no-apps #28765
VS2013

00:04:16

passed VS2015-32-bit-shared-apps #28754
VS2015

00:06:09

passed VS2015-32-bit-shared-no-apps #28755
VS2015

00:04:52

passed VS2015-32-bit-static-apps #28758
VS2015

00:06:13

passed VS2015-32-bit-static-no-apps #28759
VS2015

00:04:59

passed VS2015-64-bit-shared-apps #28752
VS2015

00:07:13

passed VS2015-64-bit-shared-no-apps #28753
VS2015

00:05:33

passed VS2015-64-bit-static-apps #28756
VS2015

00:06:55

passed VS2015-64-bit-static-no-apps #28757
VS2015

00:05:46

 
Name Stage Failure
failed
clang-c++11 Test There is an unknown failure, please try again
/home/gitlab-runner/sw/gtest-1.7.0/include/gtest/gtest.h:1456: undefined reference to `testing::internal::EqFailure(char const*, char const*, std::__cxx11::basic_string<char, std::char_traits<char>, std::allocator<char> > const&, std::__cxx11::basic_string<char, std::char_traits<char>, std::allocator<char> > const&, bool)'
clang: error: linker command failed with exit code 1 (use -v to see invocation)
src/Unittests/CMakeFiles/unittests.dir/build.make:1320: recipe for target 'Unittests/unittests' failed
make[2]: *** [Unittests/unittests] Error 1
CMakeFiles/Makefile2:1088: recipe for target 'src/Unittests/CMakeFiles/unittests.dir/all' failed
make[1]: *** [src/Unittests/CMakeFiles/unittests.dir/all] Error 2
Makefile:149: recipe for target 'all' failed
make: *** [all] Error 2
ERROR: Job failed: exit status 1
failed
gcc-c++98 Test There is an unknown failure, please try again
/usr/bin/ld: final link failed: Nonrepresentable section on output
collect2: error: ld returned 1 exit status
src/Unittests/CMakeFiles/unittests.dir/build.make:1320: recipe for target 'Unittests/unittests' failed
make[2]: *** [Unittests/unittests] Error 1
CMakeFiles/Makefile2:1088: recipe for target 'src/Unittests/CMakeFiles/unittests.dir/all' failed
make[1]: *** [src/Unittests/CMakeFiles/unittests.dir/all] Error 2
Makefile:149: recipe for target 'all' failed
make: *** [all] Error 2
ERROR: Job failed: exit status 1
failed
clang-c++98 Test There is an unknown failure, please try again
                                                                  ^
1 error generated.
src/Unittests/CMakeFiles/unittests.dir/build.make:422: recipe for target 'src/Unittests/CMakeFiles/unittests.dir/unittests_property.cc.o' failed
make[2]: *** [src/Unittests/CMakeFiles/unittests.dir/unittests_property.cc.o] Error 1
CMakeFiles/Makefile2:1088: recipe for target 'src/Unittests/CMakeFiles/unittests.dir/all' failed
make[1]: *** [src/Unittests/CMakeFiles/unittests.dir/all] Error 2
Makefile:149: recipe for target 'all' failed
make: *** [all] Error 2
ERROR: Job failed: exit status 1
failed
cppcheck Test There is an unknown failure, please try again

==============================================================================
CPPCHECK Summary
==============================================================================


Total CPPCHECK error Count is 19, which is too High! CPPCHECK Run failed

ERROR: Job failed: exit status 1
failed
gcc-c++11 Test There is an unknown failure, please try again
/usr/bin/ld: final link failed: Nonrepresentable section on output
collect2: error: ld returned 1 exit status
src/Unittests/CMakeFiles/unittests.dir/build.make:1320: recipe for target 'Unittests/unittests' failed
make[2]: *** [Unittests/unittests] Error 1
CMakeFiles/Makefile2:1088: recipe for target 'src/Unittests/CMakeFiles/unittests.dir/all' failed
make[1]: *** [src/Unittests/CMakeFiles/unittests.dir/all] Error 2
Makefile:149: recipe for target 'all' failed
make: *** [all] Error 2
ERROR: Job failed: exit status 1