wip

7 jobs for v3-dev-ovmb1 in 8 minutes and 31 seconds (queued for 4 seconds)
Status Name Job ID Coverage
  Test
failed clang-c++17 #139939
Linux

00:08:31

passed cppcheck #139941
Linux

00:00:52

passed doc #139944
Linux

00:00:14

failed gcc-c++17 #139938
Linux

00:06:32

failed macos-c++17 #139940
Apple

00:00:06

failed VS2019-32-bit #139942
VS2019

00:01:40

failed VS2019-64-bit #139943
VS2019

00:02:19

 
Name Stage Failure
failed
VS2019-64-bit Test
E:\gitlab\builds\mJQzyNSJ\0\OpenVolumeMesh\OpenVolumeMesh\build-debug>cd .. 

E:\gitlab\builds\mJQzyNSJ\0\OpenVolumeMesh\OpenVolumeMesh>cd src\Unittests\TestFiles

E:\gitlab\builds\mJQzyNSJ\0\OpenVolumeMesh\OpenVolumeMesh\src\Unittests\TestFiles>..\..\..\build-debug\Unittests\Debug\unittests.exe

E:\gitlab\builds\mJQzyNSJ\0\OpenVolumeMesh\OpenVolumeMesh\src\Unittests\TestFiles>IF -1073741515 NEQ 0 exit /b -1073741515
Cleaning up file based variables
ERROR: Job failed: exit status 1
failed
gcc-c++17 Test
[  FAILED  ] PolyhedralFileTest/0.SaveFileWithProps, where TypeParam = std::integral_constant<bool, true>
[ FAILED ] PolyhedralFileTest/0.SaveFileWithVectorProps, where TypeParam = std::integral_constant<bool, true>
[ FAILED ] PolyhedralFileTest/0.SerializeVectorValuedProperties, where TypeParam = std::integral_constant<bool, true>
[ FAILED ] PolyhedralFileTest/0.LoadFileWithProps, where TypeParam = std::integral_constant<bool, true>
[ FAILED ] PolyhedralFileTest/0.SaveFileWithProps2, where TypeParam = std::integral_constant<bool, true>
[ FAILED ] HexahedralFileTest/0.LoadFile, where TypeParam = std::integral_constant<bool, true>

9 FAILED TESTS
Cleaning up file based variables
ERROR: Job failed: exit status 1
failed
clang-c++17 Test
[  FAILED  ] PolyhedralFileTest/0.SaveFileWithProps, where TypeParam = std::integral_constant<bool, true>
[ FAILED ] PolyhedralFileTest/0.SaveFileWithVectorProps, where TypeParam = std::integral_constant<bool, true>
[ FAILED ] PolyhedralFileTest/0.SerializeVectorValuedProperties, where TypeParam = std::integral_constant<bool, true>
[ FAILED ] PolyhedralFileTest/0.LoadFileWithProps, where TypeParam = std::integral_constant<bool, true>
[ FAILED ] PolyhedralFileTest/0.SaveFileWithProps2, where TypeParam = std::integral_constant<bool, true>
[ FAILED ] HexahedralFileTest/0.LoadFile, where TypeParam = std::integral_constant<bool, true>

9 FAILED TESTS
Cleaning up file based variables
ERROR: Job failed: exit status 1
failed
macos-c++17 Test
In file included from /Users/jenkins/builds/8dfb9a4a/0/OpenVolumeMesh/OpenVolumeMesh/src/OpenVolumeMesh/Core/TopologyKernel.hh:45:
/Users/jenkins/builds/8dfb9a4a/0/OpenVolumeMesh/OpenVolumeMesh/src/OpenVolumeMesh/Core/ResourceManager.hh:45:10: fatal error: 'optional' file not found
#include <optional>
^
4 errors generated.
make[2]: *** [src/CMakeFiles/OpenVolumeMesh.dir/OpenVolumeMesh/Attribs/InterfaceAttrib.cc.o] Error 1
make[1]: *** [src/CMakeFiles/OpenVolumeMesh.dir/all] Error 2
make: *** [all] Error 2
Cleaning up file based variables
ERROR: Job failed: exit status 1
failed
VS2019-32-bit Test
E:\gitlab\builds\cu6mRa6g\0\OpenVolumeMesh\OpenVolumeMesh\build-debug>cd .. 

E:\gitlab\builds\cu6mRa6g\0\OpenVolumeMesh\OpenVolumeMesh>cd src\Unittests\TestFiles

E:\gitlab\builds\cu6mRa6g\0\OpenVolumeMesh\OpenVolumeMesh\src\Unittests\TestFiles>..\..\..\build-debug\Unittests\Debug\unittests.exe

E:\gitlab\builds\cu6mRa6g\0\OpenVolumeMesh\OpenVolumeMesh\src\Unittests\TestFiles>IF -1073741515 NEQ 0 exit /b -1073741515
Cleaning up file based variables
ERROR: Job failed: exit status 1