Split unittests into seperate files

6 jobs for v2beta
Status Job ID Name Coverage
  Test
failed clang-c++11 #1092
Linux

00:01:21

failed clang-c++98 #1094
Linux

00:01:09

failed gcc-c++11 #1091
Linux

00:01:59

failed gcc-c++98 #1093
Linux

00:01:19

failed macos-c++11 #1095
Apple

00:00:49

failed macos-c++98 #1096
Apple

00:00:48

 
Name Stage Failure
failed
clang-c++11 Test There is an unknown failure, please try again
[  FAILED  ] PolyhedralMeshBase.DeleteFaceBUTest1
[ FAILED ] PolyhedralMeshBase.DeleteEdgeBUTest1
[ FAILED ] PolyhedralMeshBase.DeleteFaceBUTest1noBU
[ FAILED ] PolyhedralMeshBase.DeleteEdgeBUTest1noBU
[ FAILED ] HexahedralMeshBase.BottomUpIncidenceUpdate1

5 FAILED TESTS

ERROR: Build failed with: exit status 1
failed
macos-c++98 Test There is an unknown failure, please try again
Which is: 8
/Users/jenkins/gitlab-runner/builds/8dfb9a4a/0/OpenVolumeMesh/OpenVolumeMesh/src/Unittests/unittests_basics.cc:1237: Failure
Value of: mesh_.n_cells()
Actual: 2
Expected: 1u
Which is: 1
CI/ci-mac.sh: line 46: 47514 Segmentation fault: 11 ./unittests --gtest_color=yes --gtest_output=xml

ERROR: Build failed with: exit status 1
failed
gcc-c++11 Test There is an unknown failure, please try again
[  FAILED  ] HexahedralMeshBase.BottomUpIncidenceUpdate1
[ FAILED ] PolyhedralMeshBase.DeleteFaceBUTest1
[ FAILED ] PolyhedralMeshBase.DeleteEdgeBUTest1
[ FAILED ] PolyhedralMeshBase.DeleteFaceBUTest1noBU
[ FAILED ] PolyhedralMeshBase.DeleteEdgeBUTest1noBU

5 FAILED TESTS

ERROR: Build failed with: exit status 1
failed
gcc-c++98 Test There is an unknown failure, please try again
[  FAILED  ] HexahedralMeshBase.BottomUpIncidenceUpdate1
[ FAILED ] PolyhedralMeshBase.DeleteFaceBUTest1
[ FAILED ] PolyhedralMeshBase.DeleteEdgeBUTest1
[ FAILED ] PolyhedralMeshBase.DeleteFaceBUTest1noBU
[ FAILED ] PolyhedralMeshBase.DeleteEdgeBUTest1noBU

5 FAILED TESTS

ERROR: Build failed with: exit status 1
failed
clang-c++98 Test There is an unknown failure, please try again
[  FAILED  ] HexahedralMeshBase.BottomUpIncidenceUpdate1
[ FAILED ] PolyhedralMeshBase.DeleteFaceBUTest1
[ FAILED ] PolyhedralMeshBase.DeleteEdgeBUTest1
[ FAILED ] PolyhedralMeshBase.DeleteFaceBUTest1noBU
[ FAILED ] PolyhedralMeshBase.DeleteEdgeBUTest1noBU

5 FAILED TESTS

ERROR: Build failed with: exit status 1
failed
macos-c++11 Test There is an unknown failure, please try again
[  FAILED  ] PolyhedralMeshBase.DeleteFaceBUTest1
[ FAILED ] PolyhedralMeshBase.DeleteEdgeBUTest1
[ FAILED ] PolyhedralMeshBase.DeleteFaceBUTest1noBU
[ FAILED ] PolyhedralMeshBase.DeleteEdgeBUTest1noBU
[ FAILED ] HexahedralMeshBase.BottomUpIncidenceUpdate1

5 FAILED TESTS

ERROR: Build failed with: exit status 1