fix serializer bug

6 jobs for v2beta
Status Name Job ID Coverage
  Test
failed clang-c++11 #1214
Linux

00:02:05

failed clang-c++98 #1216
Linux

00:01:52

failed gcc-c++11 #1213
Linux

00:03:10

failed gcc-c++98 #1215
Linux

00:02:22

failed macos-c++11 #1217
Apple

00:01:00

failed macos-c++98 #1218
Apple

00:00:57

 
Name Stage Failure
failed
gcc-c++11 Test There is an unknown failure, please try again
make[3]: *** [Unittests/unittests] Error 1
CMakeFiles/Makefile2:167: recipe for target 'src/Unittests/CMakeFiles/unittests.dir/all' failed
make[2]: *** [src/Unittests/CMakeFiles/unittests.dir/all] Error 2
CMakeFiles/Makefile2:179: recipe for target 'src/Unittests/CMakeFiles/unittests.dir/rule' failed
make[1]: *** [src/Unittests/CMakeFiles/unittests.dir/rule] Error 2
Makefile:177: recipe for target 'unittests' failed
make: *** [unittests] Error 2

ERROR: Build failed with: exit status 1
failed
clang-c++11 Test There is an unknown failure, please try again
make[3]: *** [Unittests/unittests] Error 1
CMakeFiles/Makefile2:167: recipe for target 'src/Unittests/CMakeFiles/unittests.dir/all' failed
make[2]: *** [src/Unittests/CMakeFiles/unittests.dir/all] Error 2
CMakeFiles/Makefile2:179: recipe for target 'src/Unittests/CMakeFiles/unittests.dir/rule' failed
make[1]: *** [src/Unittests/CMakeFiles/unittests.dir/rule] Error 2
Makefile:177: recipe for target 'unittests' failed
make: *** [unittests] Error 2

ERROR: Build failed with: exit status 1
failed
gcc-c++98 Test There is an unknown failure, please try again
make[3]: *** [Unittests/unittests] Error 1
CMakeFiles/Makefile2:167: recipe for target 'src/Unittests/CMakeFiles/unittests.dir/all' failed
make[2]: *** [src/Unittests/CMakeFiles/unittests.dir/all] Error 2
CMakeFiles/Makefile2:179: recipe for target 'src/Unittests/CMakeFiles/unittests.dir/rule' failed
make[1]: *** [src/Unittests/CMakeFiles/unittests.dir/rule] Error 2
Makefile:177: recipe for target 'unittests' failed
make: *** [unittests] Error 2

ERROR: Build failed with: exit status 1
failed
clang-c++98 Test There is an unknown failure, please try again
make[3]: *** [Unittests/unittests] Error 1
CMakeFiles/Makefile2:167: recipe for target 'src/Unittests/CMakeFiles/unittests.dir/all' failed
make[2]: *** [src/Unittests/CMakeFiles/unittests.dir/all] Error 2
CMakeFiles/Makefile2:179: recipe for target 'src/Unittests/CMakeFiles/unittests.dir/rule' failed
make[1]: *** [src/Unittests/CMakeFiles/unittests.dir/rule] Error 2
Makefile:177: recipe for target 'unittests' failed
make: *** [unittests] Error 2

ERROR: Build failed with: exit status 1
failed
macos-c++11 Test There is an unknown failure, please try again
  "OpenVolumeMesh::has_output_operator<std::__1::basic_ostream<char, std::__1::char_traits<char> >, OpenVolumeMesh::OpenVolumeMeshStatus>::value", referenced from:
std::__1::basic_ostream<char, std::__1::char_traits<char> >& OpenVolumeMesh::serialize<OpenVolumeMesh::OpenVolumeMeshStatus>(std::__1::basic_ostream<char, std::__1::char_traits<char> >&, OpenVolumeMesh::OpenVolumeMeshStatus const&) in StatusAttrib.cc.o
ld: symbol(s) not found for architecture x86_64
clang: error: linker command failed with exit code 1 (use -v to see invocation)
make[2]: *** [src/libOpenVolumeMesh.2.0.dylib] Error 1
make[1]: *** [src/CMakeFiles/OpenVolumeMesh.dir/all] Error 2
make: *** [all] Error 2

ERROR: Build failed with: exit status 1
failed
macos-c++98 Test There is an unknown failure, please try again
  "OpenVolumeMesh::has_output_operator<std::__1::basic_ostream<char, std::__1::char_traits<char> >, OpenVolumeMesh::OpenVolumeMeshStatus>::value", referenced from:
std::__1::basic_ostream<char, std::__1::char_traits<char> >& OpenVolumeMesh::serialize<OpenVolumeMesh::OpenVolumeMeshStatus>(std::__1::basic_ostream<char, std::__1::char_traits<char> >&, OpenVolumeMesh::OpenVolumeMeshStatus const&) in StatusAttrib.cc.o
ld: symbol(s) not found for architecture x86_64
clang: error: linker command failed with exit code 1 (use -v to see invocation)
make[2]: *** [src/libOpenVolumeMesh.2.0.dylib] Error 1
make[1]: *** [src/CMakeFiles/OpenVolumeMesh.dir/all] Error 2
make: *** [all] Error 2

ERROR: Build failed with: exit status 1