Revert some explicits

12 jobs for fix_cppchecks in 1 minute and 50 seconds
Status Job ID Name Coverage
  Test
canceled clang-c++11 #23665
Linux

00:01:33

canceled clang-c++98 #23667
Linux

00:01:07

failed cppcheck #23670
Linux

00:00:22

passed doc #23675
Linux

00:00:08

canceled gcc-c++11 #23664
Linux

00:01:38

failed gcc-c++98 #23666
Linux

00:01:03

canceled macos-c++11 #23668
Apple

canceled macos-c++98 #23669
Apple

canceled VS2013-32-bit #23674
VS2013

canceled VS2013-64-bit #23673
VS2013

canceled VS2015-32-bit #23672
VS2015

canceled VS2015-64-bit #23671
VS2015

 
Name Stage Failure
failed
gcc-c++98 Test There is an unknown failure, please try again
/usr/bin/ld: final link failed: Nonrepresentable section on output
collect2: error: ld returned 1 exit status
src/Unittests/CMakeFiles/unittests.dir/build.make:253: recipe for target 'Unittests/unittests' failed
make[2]: *** [Unittests/unittests] Error 1
CMakeFiles/Makefile2:184: recipe for target 'src/Unittests/CMakeFiles/unittests.dir/all' failed
make[1]: *** [src/Unittests/CMakeFiles/unittests.dir/all] Error 2
Makefile:127: recipe for target 'all' failed
make: *** [all] Error 2
ERROR: Build failed: exit status 1
failed
cppcheck Test There is an unknown failure, please try again

==============================================================================
CPPCHECK Summary
==============================================================================


Total CPPCHECK error Count is 20, which is too High! CPPCHECK Run failed

ERROR: Build failed: exit status 1