Updated tg

3 jobs for agrabowy in 4 minutes and 36 seconds (queued for 1 second)
Name Stage Failure
failed
clang-buster Build
/local/gitlab-runner/builds/mhfSL8ex/0/ptrettner/tg-samples/tests/feature/fixed_int/fixed_int.cc:441:5: note: in instantiation of function template specialization '(anonymous namespace)::check_mul<4, 1, 4>' requested here
check_mul<4, 1, 4>(rng);
^
3 errors generated.
make[2]: *** [CMakeFiles/tg-tests.dir/build.make:284: CMakeFiles/tg-tests.dir/tests/feature/fixed_int/fixed_int.cc.o] Error 1
make[1]: *** [CMakeFiles/Makefile2:572: CMakeFiles/tg-tests.dir/all] Error 2
make: *** [Makefile:84: all] Error 2
Cleaning up file based variables
ERROR: Job failed: exit status 1